{"text_format":"1","workbook":"xlsx","n_sheets":8,"sheets":["zadání","tisk oktávy","tisk třetinooktávy","calc","lang","db_kul","db_bun","db_kruh"],"not_rendered":{"charts":10,"images":8,"macros":1,"external_links":0,"defined_names":0,"comments":3,"pivot_tables":0},"unopened":[],"bounds":{"document_bytes":16777216,"sheet_cells":100000,"rows_first":2000,"rows_last":500,"rows_between":2000,"halvings":0,"cell_chars":16384,"cell_head_chars":4096},"cells_cut":0,"cells_raw":0,"read":"whole","date_system":"1900"}

{"sheet":"zadání","index":0,"n_rows":96,"n_cols":35,"rows_kept":96,"cut":false,"hidden":false,"merged":[[95,3,95,13],[94,3,94,13],[19,11,19,12],[39,3,39,4],[85,1,86,3],[85,4,86,4],[85,5,86,5],[51,13,51,14],[60,12,61,13],[62,12,62,13],[63,12,63,13],[64,0,64,3],[63,0,63,3],[62,0,62,3],[33,11,33,12],[92,0,92,1],[64,12,64,13],[3,11,3,12],[14,11,14,14]]}
[{"$f":"lang!A3","v":"v. 1.1.5"},null,null,{"$f":"lang!A2","v":"TLUMIČE HLUKU"}]
[null,null,null,null,null,null,null,null,null,null,null,null,null,null,{"$f":"lang!A4","v":"Ján Skovajsa-KLIMAT, Beckov 587, 916 38 | klimat@klimat.sk| www.klimat.sk | tel.: +421 032 777 7441"}]
[{"$f":"lang!A5","v":"Typ tlumiče"}]
[null,null,{"$f":"lang!A6","v":"kulisový"},null,null,{"$f":"lang!A7","v":"buňkový"},null,null,{"$f":"lang!A80","v":"kruhový"},null,null,{"$f":"lang!A8","v":"jazyk:"},null,"CZ"]
[{"$f":"lang!A9","v":"Kulisový tlumič"}]
[]
[]
[]
[null,{"$f":"lang!A10","v":"šířka tlumiče:"},"A",1000,"mm",null,null,null,null,{"$f":"lang!A13","v":"šířka kulisy:"},"s",100,"mm"]
[]
[null,{"$f":"lang!A11","v":"výška tlumiče:"},"B",300,"mm",null,null,null,null,{"$f":"lang!A14","v":"počet kulis:"},"n",2]
[]
[null,{"$f":"lang!A12","v":"délka tlumiče:"},"LT",1000,"mm",null,null,null,null,{"$f":"lang!A15","v":"průtočná mezera:"},"m",{"$f":"db_kul!F5","v":266.66666666666669},{"$f":"calc!H33","v":"mm"}]
[]
[null,null,null,null,null,null,null,null,null,{"$f":"lang!A16","v":"úprava hran:"},null,"bez úpravy"]
[]
[{"$f":"lang!A20","v":"Buňkový tlumič"}]
[]
[]
[]
[]
[null,{"$f":"lang!A21","v":"šířka buňky:"},"A",250,"mm",null,null,null,null,{"$f":"lang!A25","v":"tloušťka izolace:"},"D",50,"mm"]
[]
[null,{"$f":"lang!A22","v":"výška buňky:"},"B",600,"mm",null,null,null,null,{"$f":"lang!A26","v":"počet buněk:"},"n × m",5,"     x",2]
[]
[null,{"$f":"lang!A23","v":"délka buňky:"},"L",2000,"mm",null,null,null,null,{"$f":"lang!A15","v":"průtočná mezera:"},"s",{"$f":"db_bun!F12","v":150},"mm"]
[]
[null,null,null,null,null,null,null,null,null,{"$f":"lang!A24","v":"celkový rozměr:"},{"$f":"calc!G36","v":"1250 x 1200 x 2000 mm"}]
[]
["Kruhový tlumič"]
[]
[null,{"$f":"lang!A76","v":"průměr tlumiče:"},"D",140,"mm",null,null,null,null,{"$f":"lang!A12","v":"délka tlumiče:"},"l",900,"mm"]
[]
[null,{"$f":"lang!A25","v":"tloušťka izolace:"},"SD",{"$f":"db_kruh!B8","v":50},"mm",null,null,null,null,{"$f":"lang!A77","v":"provedení:"},{"$f":"IF(AND(L34=lang!A79,D32>315),1,0)","v":0},"bez jádra"]
[]
[{"$f":"lang!A27","v":"dopočítat vlastní hluk a tlakovou ztrátu"},null,null,null,null,null,{"$f":"IF(calc!$Q$6=TRUE,1,0)","v":1},null,null,{"$f":"lang!A28","v":"útlum ve frekvenci:"},null,55,"Hz"]
[]
[{"$f":"lang!A29","v":"Okrajové podmínky před tlumičem"}]
[]
[null,{"$f":"lang!A30","v":"průtok vzduchu:"},"V",10000,null,"m3/h",null,null,null,{"$f":"lang!A32","v":"hustota vzduchu:"},"ρ",1.2,"kg/m3"]
[]
[null,null,null,null,{"$f":"lang!A31","v":"hladina akustického výkonu zdroje:"},null,null,null,{"$f":"lang!A66","v":"váhový filtr A"},null,null,{"$f":"IF(calc!Q7=TRUE,1,0)","v":1}]
[null,null,null,{"$f":"lang!A61","v":"frekvence"},63,125,250,500,1000,2000,4000,8000,"Σ","Hz"]
[null,null,null,{"$f":"IF(L42=0,\"Lw\",\"Lw(A)\")","v":"Lw(A)"},58,65,68,75,80,77,70,68,{"$f":"calc!N44","v":83.183845144496871},"dB"]
[]
[{"$f":"lang!A70","v":"přidat zadání v třetinooktávových pásmech:"},null,null,null,null,null,null,null,{"$f":"IF(calc!$D$48=TRUE,1,0)","v":0}]
[null,{"$f":"D43","v":"frekvence"},16,20,25,31.5,40,50,63,80,100,125,160,200,250,315,400,500,630,800,1000,1250,1600,2000,2500,3150,4000,5000,6300,8000,10000,12500,16000,"Σ","Hz"]
[null,{"$f":"D44","v":"Lw(A)"},15,25,48,36,27,55,42,45,48,53,56,58,61,64,70,75,73,78,80,81,77,75,70,68,67,60,58,55,51,45,41,{"$f":"calc!AI16","v":86.639251127389684},"dB"]
[]
[{"$f":"lang!A45","v":"dopočítat hladinu akustického tlaku v místě posluchače"},null,null,null,null,null,null,null,{"$f":"IF(calc!$D$28=TRUE,1,0)","v":0}]
[]
[null,null,null,null,null,{"$f":"lang!A46","v":"vzdálenost k posluchači:"},"r",2,"m",{"$f":"calc!I32","v":1},null,{"$f":"lang!A53","v":"prostředí:"},null,"interiér"]
[]
[null,null,null,null,null,{"$f":"lang!A47","v":"směrový činitel:"},"Q",2,null,null,null,{"$f":"lang!A69","v":"rezerva Lp:"},null,0,"dB"]
[]
[null,null,null,null,null,{"$f":"lang!A48","v":"střední hodnota součinitele zvukové pohltivosti:"},"α",0.4,null,null,null,{"$f":"lang!A52","v":"celková plocha místnosti:"},"S",60,"m2"]
[]
[null,null,null,null,null,{"$f":"lang!A49","v":"akustický výkon koncového elementu:"},"LWKO",40,"dB",null,null,{"$f":"lang!A51","v":"počet vyústek:"},"KE",1,{"$f":"lang!A56","v":"ks"}]
[]
[{"$f":"lang!A33","v":"Výstup v oktávových pásmech"}]
[null,null,null,null,null,null,null,null,null,null,null,null,{"$f":"lang!A34","v":"součtová hladina"}]
[null,null,null,null,63,125,250,500,1000,2000,4000,8000,null,null,"Hz"]
[{"$f":"lang!A35","v":"vložený útlum"},null,null,null,{"$f":"calc!E42","v":17.419600000000003},{"$f":"calc!F42","v":24.320926666666672},{"$f":"calc!G42","v":28.071666666666669},{"$f":"calc!H42","v":46.776933333333339},{"$f":"calc!I42","v":102.76046666666666},{"$f":"calc!J42","v":71.904093333333336},{"$f":"calc!K42","v":60.808533333333337},{"$f":"calc!L42","v":48.951866666666668},"-",null,"dB"]
[{"$f":"lang!A36","v":"vlastní hluk tlumiče"},null,null,null,{"$f":"calc!E43","v":0},{"$f":"calc!F43","v":0},{"$f":"calc!G43","v":0},{"$f":"calc!H43","v":0},{"$f":"calc!I43","v":0},{"$f":"calc!J43","v":0},{"$f":"calc!K43","v":0},{"$f":"calc!L43","v":0},{"$f":"calc!N43","v":0},null,{"$f":"IF($L$42=0,\"dB\",\"dB(A)\")","v":"dB(A)"}]
[{"$f":"lang!A37","v":"     akustický výkon za tlumičem"},null,null,null,{"$f":"calc!E47","v":40.580779949006917},{"$f":"calc!F47","v":40.679444747450681},{"$f":"calc!G47","v":39.928774831498345},{"$f":"calc!H47","v":28.229600242329987},{"$f":"calc!I47","v":0},{"$f":"calc!J47","v":6.2663678312627109},{"$f":"calc!K47","v":9.6854414978441437},{"$f":"calc!L47","v":19.1018713097736},{"$f":"calc!N47","v":45.279227834853586},null,{"$f":"IF($L$42=0,\"dB\",\"dB(A)\")","v":"dB(A)"}]
[]
[]
[]
[]
[]
[]
[]
[]
[]
[]
[]
[]
[]
[]
[]
[]
[null,null,null,{"$f":"lang!A38","v":"tlaková ztráta:"},{"$f":"calc!S43","v":3.9585767752205809},"Pa",null,null,null,null,{"$f":"lang!A39","v":"rychlost v celkovém průřezu:"},{"$f":"calc!S41","v":1.8518518518518519},"m/s"]
[]
[null,null,null,{"$f":"CONCATENATE(lang!A35,\" pro \",L36,\" Hz:\")","v":"vložený útlum pro 55 Hz:"},{"$f":"calc!S44","v":9.94649230769231},"dB",null,null,null,null,{"$f":"lang!A40","v":"rychlost ve volné ploše:"},{"$f":"calc!S42","v":3.0864197530864201},"m/s"]
[]
[null,{"$f":"lang!A50","v":"hladina akustického tlaku v místě posluchače Lp:"},null,null,{"$f":"calc!S45","v":""},{"$f":"O64","v":"dB(A)"},null,null,null,null,null,{"$f":"calc!AC19","v":""}]
[null,null,null,null,null,null,null,null,null,null,{"$f":"lang!A65","v":"plocha tlumiče:"},{"$f":"calc!W37","v":24},"m2"]
[]
[{"$f":"lang!A71","v":"Výstup v třetinooktávových pásmech"}]
[null,{"$f":"D43","v":"frekvence"},16,20,25,31.5,40,50,63,80,100,125,160,200,250,315,400,500,630,800,1000,1250,1600,2000,2500,3150,4000,5000,6300,8000,10000,12500,16000,"Σ","Hz"]
[null,{"$f":"lang!A35","v":"vložený útlum"},{"$f":"calc!C49","v":0.16666666666666666},{"$f":"calc!D49","v":0.19999999999999998},{"$f":"calc!E49","v":7.4083333333333341},{"$f":"calc!F49","v":13.48833333333333},{"$f":"calc!G49","v":12.736253333333327},{"$f":"calc!H49","v":5.2758000000000012},{"$f":"calc!I49","v":17.419600000000003},{"$f":"calc!J49","v":15.170000000000009},{"$f":"calc!K49","v":10.775000000000002},{"$f":"calc!L49","v":24.320926666666672},{"$f":"calc!M49","v":0.66666666666666663},{"$f":"calc!N49","v":4.0166666666666648},{"$f":"calc!O49","v":28.071666666666669},{"$f":"calc!P49","v":9.6974133333333317},{"$f":"calc!Q49","v":12.521400000000005},{"$f":"calc!R49","v":46.776933333333339},{"$f":"calc!S49","v":29.105360000000001},{"$f":"calc!T49","v":36.619013333333342},{"$f":"calc!U49","v":102.76046666666666},{"$f":"calc!V49","v":38.22},{"$f":"calc!W49","v":26.695186666666675},{"$f":"calc!X49","v":71.904093333333336},{"$f":"calc!Y49","v":16.25732},{"$f":"calc!Z49","v":12.178266666666657},{"$f":"calc!AA49","v":60.808533333333337},{"$f":"calc!AB49","v":10.487399999999999},{"$f":"calc!AC49","v":17.134033333333324},{"$f":"calc!AD49","v":48.951866666666668},{"$f":"calc!AE49","v":7.8318933333333343},{"$f":"calc!AF49","v":6.5626933333333319},{"$f":"calc!AG49","v":7.8940000000000028},"-","dB"]
[null,{"$f":"lang!A36","v":"vlastní hluk tlumiče"},{"$f":"calc!C50","v":0},{"$f":"calc!D50","v":0},{"$f":"calc!E50","v":0},{"$f":"calc!F50","v":0},{"$f":"calc!G50","v":0},{"$f":"calc!H50","v":0},{"$f":"calc!I50","v":0},{"$f":"calc!J50","v":0},{"$f":"calc!K50","v":0},{"$f":"calc!L50","v":0},{"$f":"calc!M50","v":0},{"$f":"calc!N50","v":0},{"$f":"calc!O50","v":0},{"$f":"calc!P50","v":0},{"$f":"calc!Q50","v":0},{"$f":"calc!R50","v":0},{"$f":"calc!S50","v":0},{"$f":"calc!T50","v":0},{"$f":"calc!U50","v":0},{"$f":"calc!V50","v":0},{"$f":"calc!W50","v":0},{"$f":"calc!X50","v":0},{"$f":"calc!Y50","v":0},{"$f":"calc!Z50","v":0},{"$f":"calc!AA50","v":0},{"$f":"calc!AB50","v":0},{"$f":"calc!AC50","v":0},{"$f":"calc!AD50","v":0},{"$f":"calc!AE50","v":0},{"$f":"calc!AF50","v":0},{"$f":"calc!AG50","v":0},{"$f":"calc!AI50","v":"<15"},{"$f":"O64","v":"dB(A)"}]
[{"$f":"lang!A37","v":"     akustický výkon za tlumičem"},null,{"$f":"calc!C51","v":14.973747635874805},{"$f":"calc!D51","v":24.814357084593873},{"$f":"calc!E51","v":40.592045631312828},{"$f":"calc!F51","v":22.535955275921321},{"$f":"calc!G51","v":14.42348106330634},{"$f":"calc!H51","v":49.724246276659052},{"$f":"calc!I51","v":24.595500421551314},{"$f":"calc!J51","v":29.834513969219163},{"$f":"calc!K51","v":37.225822703179055},{"$f":"calc!L51","v":28.68495611602043},{"$f":"calc!M51","v":55.333346052256459},{"$f":"calc!N51","v":53.983350689352065},{"$f":"calc!O51","v":32.930545614688654},{"$f":"calc!P51","v":54.302602792599195},{"$f":"calc!Q51","v":57.478607761111505},{"$f":"calc!R51","v":28.229600242329987},{"$f":"calc!S51","v":43.894817137884765},{"$f":"calc!T51","v":41.381302654124646},{"$f":"calc!U51","v":0},{"$f":"calc!V51","v":42.780228966983664},{"$f":"calc!W51","v":50.304853818968176},{"$f":"calc!X51","v":4.8284707691685886},{"$f":"calc!Y51","v":53.742698344901932},{"$f":"calc!Z51","v":55.821744699405528},{"$f":"calc!AA51","v":7.1269270173698329},{"$f":"calc!AB51","v":49.512648587201099},{"$f":"calc!AC51","v":40.86632243710266},{"$f":"calc!AD51","v":7.0117407262180897},{"$f":"calc!AE51","v":43.168316060156428},{"$f":"calc!AF51","v":38.437928999232518},{"$f":"calc!AG51","v":33.108123626448844},{"$f":"calc!AI51","v":63.893495914499816},{"$f":"O65","v":"dB(A)"}]
[null,null,{"$f":"lang!A43","v":"kód výrobku:"}]
[null,null,null,{"$f":"lang!A41","v":"Technické řešení:"}]
[null,null,null,{"$f":"lang!A42","v":"Vysoké učení technické v Brně - Fakulta stavební - Ústav technických zařízení budov"}]

{"sheet":"tisk oktávy","index":1,"n_rows":56,"n_cols":15,"rows_kept":56,"cut":false,"hidden":false,"merged":[[15,10,15,11],[13,10,13,11],[55,3,55,14],[20,10,20,11],[25,0,25,3],[26,0,26,3],[27,0,27,3],[23,12,23,13],[25,12,25,13],[26,12,26,13],[27,12,27,13],[20,2,20,3],[24,12,24,13],[24,0,24,3]]}
[]
["Ján Skovajsa-KLIMAT, "]
["Beckov 587, 916 38"]
["klimat@klimat.sk"]
["www.klimat.sk"]
["+421 032 777 7441"]
[]
[{"$f":"CONCATENATE(zadání!A5, ,lang!A72)","v":"Kulisový tlumič - výrobní parametry"}]
[null,{"$f":"lang!A10","v":"šířka tlumiče:"},"A",{"$f":"zadání!D9","v":1000},"mm",null,null,null,null,{"$f":"lang!A13","v":"šířka kulisy:"},"m",{"$f":"zadání!L9","v":100},"mm"]
[null,{"$f":"lang!A11","v":"výška tlumiče:"},"B",{"$f":"zadání!D11","v":300},"mm",null,null,null,null,{"$f":"lang!A14","v":"počet kulis:"},"n",{"$f":"zadání!L11","v":2}]
[null,{"$f":"lang!A12","v":"délka tlumiče:"},"LT",{"$f":"zadání!D13","v":1000},"mm",null,null,null,null,{"$f":"lang!A15","v":"průtočná mezera:"},"s",{"$f":"zadání!L13","v":266.66666666666669},"mm"]
[null,null,null,null,null,null,null,null,null,{"$f":"lang!A16","v":"úprava hran:"},null,{"$f":"zadání!L15","v":"bez úpravy"}]
[{"$f":"CONCATENATE(zadání!A17,lang!A72)","v":"Buňkový tlumič - výrobní parametry"}]
[null,{"$f":"lang!A21","v":"šířka buňky:"},"A",{"$f":"zadání!D22","v":250},"mm",null,null,null,null,{"$f":"lang!A25","v":"tloušťka izolace:"},{"$f":"zadání!L22","v":50},null,"mm"]
[null,{"$f":"lang!A22","v":"výška buňky:"},"B",{"$f":"zadání!D24","v":600},"mm",null,null,null,null,{"$f":"lang!A26","v":"počet buněk:"},{"$f":"zadání!L24","v":5},"x",{"$f":"zadání!N24","v":2},"n x m"]
[null,{"$f":"lang!A23","v":"délka buňky:"},"L",{"$f":"zadání!D26","v":2000},"mm",null,null,null,null,{"$f":"lang!A15","v":"průtočná mezera:"},{"$f":"zadání!L26","v":150},null,"mm"]
[null,null,null,null,null,null,null,null,null,{"$f":"zadání!J28","v":"celkový rozměr:"},{"$f":"zadání!K28","v":"1250 x 1200 x 2000 mm"}]
[{"$f":"lang!A81","v":"Kruhový tlumič"}]
[null,{"$f":"lang!A76","v":"průměr tlumiče:"},"D",{"$f":"zadání!$D$32","v":140},"mm",null,null,null,null,{"$f":"lang!A12","v":"délka tlumiče:"},"l",{"$f":"zadání!$L$32","v":900},"mm"]
[null,{"$f":"lang!A25","v":"tloušťka izolace:"},"SD",{"$f":"zadání!$D$34","v":50},"mm",null,null,null,null,{"$f":"lang!A77","v":"provedení:"},null,{"$f":"lang!A78","v":"bez jádra"}]
[null,{"$f":"zadání!B40","v":"průtok vzduchu:"},{"$f":"zadání!D40","v":10000},null,"m3/h"]
[null,{"$f":"zadání!C94","v":"kód výrobku:"},{"$f":"zadání!D94","v":"00:00:00"}]
[{"$f":"lang!A74","v":"Akustické charakteristiky zdroje hluku a tlumiče"}]
[null,null,null,{"$f":"zadání!D43","v":"frekvence"},63,125,250,500,1000,2000,4000,8000,{"$f":"zadání!M61","v":"součtová hladina"},null,"Hz"]
[{"$f":"lang!A75","v":"hladina akust. výkonu zdroje"},null,null,null,{"$f":"zadání!E44","v":58},{"$f":"zadání!F44","v":65},{"$f":"zadání!G44","v":68},{"$f":"zadání!H44","v":75},{"$f":"zadání!I44","v":80},{"$f":"zadání!J44","v":77},{"$f":"zadání!K44","v":70},{"$f":"zadání!L44","v":68},{"$f":"zadání!M44","v":83.183845144496871},null,{"$f":"O27","v":"dB(A)"}]
[{"$f":"zadání!A63","v":"vložený útlum"},null,null,null,{"$f":"zadání!E63","v":17.419600000000003},{"$f":"zadání!F63","v":24.320926666666672},{"$f":"zadání!G63","v":28.071666666666669},{"$f":"zadání!H63","v":46.776933333333339},{"$f":"zadání!I63","v":102.76046666666666},{"$f":"zadání!J63","v":71.904093333333336},{"$f":"zadání!K63","v":60.808533333333337},{"$f":"zadání!L63","v":48.951866666666668},"-",null,"dB"]
[{"$f":"IF(calc!$Q$6<>TRUE,\"\",zadání!A64)","v":"vlastní hluk tlumiče"},null,null,null,{"$f":"zadání!E64","v":0},{"$f":"zadání!F64","v":0},{"$f":"zadání!G64","v":0},{"$f":"zadání!H64","v":0},{"$f":"zadání!I64","v":0},{"$f":"zadání!J64","v":0},{"$f":"zadání!K64","v":0},{"$f":"zadání!L64","v":0},{"$f":"zadání!M64","v":0},null,{"$f":"zadání!O64","v":"dB(A)"}]
[{"$f":"IF(calc!$Q$6<>TRUE,\"\",zadání!A65)","v":"     akustický výkon za tlumičem"},null,null,null,{"$f":"zadání!E65","v":40.580779949006917},{"$f":"zadání!F65","v":40.679444747450681},{"$f":"zadání!G65","v":39.928774831498345},{"$f":"zadání!H65","v":28.229600242329987},{"$f":"zadání!I65","v":0},{"$f":"zadání!J65","v":6.2663678312627109},{"$f":"zadání!K65","v":9.6854414978441437},{"$f":"zadání!L65","v":19.1018713097736},{"$f":"zadání!M65","v":45.279227834853586},null,{"$f":"zadání!O65","v":"dB(A)"}]
[]
[]
[]
[]
[]
[]
[]
[]
[]
[]
[]
[]
[]
[]
[null,null,null,{"$f":"zadání!$D$82","v":"tlaková ztráta:"},{"$f":"zadání!$E$82","v":3.9585767752205809},"Pa",null,null,null,null,null,null,{"$f":"zadání!K82","v":"rychlost v celkovém průřezu:"},{"$f":"zadání!L82","v":1.8518518518518519},"m/s"]
[null,null,null,null,null,null,null,null,null,null,null,null,{"$f":"zadání!K84","v":"rychlost ve volné ploše:"},{"$f":"zadání!L84","v":3.0864197530864201},"m/s"]
[]
[{"$f":"lang!A73","v":"Hladina akustického tlaku v prostoru za tlumičem"}]
[null,null,null,null,null,null,null,{"$f":"zadání!F52","v":"vzdálenost k posluchači:"},{"$f":"zadání!H52","v":2},"m"]
[null,null,null,null,null,null,null,{"$f":"zadání!F54","v":"směrový činitel:"},{"$f":"zadání!H54","v":2}]
[null,null,null,null,null,null,null,{"$f":"IF(zadání!J52=2,zadání!L58,zadání!L56)","v":"celková plocha místnosti:"},{"$f":"IF(zadání!$J$52=2,zadání!N58,zadání!N56)","v":60},{"$f":"IF(zadání!$J$52=2,zadání!O58,\"m2\")","v":"m2"}]
[null,null,null,null,null,null,null,{"$f":"IF(zadání!$J$52=2,zadání!F58,zadání!F56)","v":"střední hodnota součinitele zvukové pohltivosti:"},{"$f":"IF(zadání!$J$52=2,zadání!H58,zadání!H56)","v":0.4},{"$f":"IF(zadání!$J$52=2,zadání!I58,\"\")","v":""}]
[null,null,null,null,null,null,null,{"$f":"IF(zadání!$J$52=2,\"\",lang!A64)","v":"počet vyústek:"},{"$f":"IF(zadání!$J$52=2,\"\",zadání!N58)","v":1},{"$f":"IF(zadání!$J$52=2,\"\",zadání!O58)","v":"ks"}]
[null,null,null,null,null,null,null,{"$f":"IF(zadání!$J$52=2,\"\",zadání!F58)","v":"akustický výkon koncového elementu:"},{"$f":"IF(zadání!$J$52=2,\"\",zadání!H58)","v":40},{"$f":"IF(zadání!$J$52=2,\"\",\"dB\")","v":"dB"}]
[null,null,null,null,null,null,null,null,null,null,null,null,{"$f":"zadání!B86","v":"hladina akustického tlaku v místě posluchače Lp:"},{"$f":"zadání!E86","v":""},{"$f":"O28","v":"dB(A)"}]
[]
[null,null,null,{"$f":"zadání!D95","v":"Technické řešení:"},null,null,null,null,null,null,null,null,null,null,{"$f":"lang!A3","v":"v. 1.1.5"}]
[null,null,null,{"$f":"zadání!D96","v":"Vysoké učení technické v Brně - Fakulta stavební - Ústav technických zařízení budov"}]

{"sheet":"tisk třetinooktávy","index":2,"n_rows":47,"n_cols":34,"rows_kept":47,"cut":false,"hidden":true,"merged":[[13,4,13,5],[14,4,14,5],[17,4,17,5],[7,4,7,5],[8,4,8,5],[9,4,9,5],[10,4,10,5],[12,4,12,5],[7,12,7,13],[8,12,8,13],[9,12,9,13],[12,12,12,13],[14,12,14,13],[18,4,18,5],[17,12,17,13],[18,12,18,14],[19,12,19,13],[15,4,15,5],[19,4,19,5]]}
[]
[]
[]
[null,null,null,null,null,null,null,null,null,null,null,null,null,null,null,null,null,null,null,null,null,null,null,null,null,null,null,null,null,null,null,null,null,{"$f":"lang!A82","v":"Air Technology s.r.o. | info@airtechnology.cz | www.airtechnology.cz | +420 518 321 001"}]
[null,null,null,null,null,null,null,null,null,null,null,null,null,null,null,null,null,null,null,null,null,null,null,null,null,null,null,null,null,null,null,null,null,{"$f":"lang!A4","v":"Ján Skovajsa-KLIMAT, Beckov 587, 916 38 | klimat@klimat.sk| www.klimat.sk | tel.: +421 032 777 7441"}]
[null,null,null,{"$f":"zadání!C94","v":"kód výrobku:"},{"$f":"zadání!D94","v":"00:00:00"}]
[null,{"$f":"zadání!A5","v":"Kulisový tlumič"}]
[null,null,null,{"$f":"lang!A10","v":"šířka tlumiče:"},{"$f":"zadání!D9","v":1000},null,"mm",null,null,null,null,{"$f":"lang!A13","v":"šířka kulisy:"},{"$f":"zadání!L9","v":100},null,"mm"]
[null,null,null,{"$f":"lang!A11","v":"výška tlumiče:"},{"$f":"zadání!D11","v":300},null,"mm",null,null,null,null,{"$f":"lang!A14","v":"počet kulis:"},{"$f":"zadání!L11","v":2}]
[null,null,null,{"$f":"lang!A12","v":"délka tlumiče:"},{"$f":"zadání!D13","v":1000},null,"mm",null,null,null,null,{"$f":"lang!A15","v":"průtočná mezera:"},{"$f":"zadání!L13","v":266.66666666666669},null,"mm"]
[null,null,null,null,null,null,null,null,null,null,null,{"$f":"lang!A16","v":"úprava hran:"},null,{"$f":"zadání!L15","v":"bez úpravy"}]
[null,{"$f":"zadání!A17","v":"Buňkový tlumič"}]
[null,null,null,{"$f":"lang!A21","v":"šířka buňky:"},{"$f":"zadání!D22","v":250},null,"mm",null,null,null,null,{"$f":"lang!A25","v":"tloušťka izolace:"},{"$f":"zadání!L22","v":50},null,"mm"]
[null,null,null,{"$f":"lang!A22","v":"výška buňky:"},{"$f":"zadání!D24","v":600},null,"mm",null,null,null,null,{"$f":"lang!A26","v":"počet buněk:"},null,{"$f":"zadání!L24","v":5},"x",{"$f":"zadání!N24","v":2}]
[null,null,null,{"$f":"lang!A23","v":"délka buňky:"},{"$f":"zadání!D26","v":2000},null,"mm",null,null,null,null,{"$f":"lang!A15","v":"průtočná mezera:"},{"$f":"zadání!L26","v":150},null,"mm"]
[null,null,null,null,null,null,null,null,null,null,null,{"$f":"zadání!J28","v":"celkový rozměr:"},null,{"$f":"zadání!K28","v":"1250 x 1200 x 2000 mm"}]
[null,{"$f":"lang!A81","v":"Kruhový tlumič"}]
[null,null,null,{"$f":"lang!A76","v":"průměr tlumiče:"},{"$f":"zadání!D32","v":140},null,"mm",null,null,null,null,{"$f":"lang!A12","v":"délka tlumiče:"},{"$f":"zadání!L32","v":900},null,"mm"]
[null,null,null,{"$f":"lang!A25","v":"tloušťka izolace:"},{"$f":"zadání!D34","v":50},null,"mm",null,null,null,null,{"$f":"lang!A77","v":"provedení:"},{"$f":"zadání!L34","v":"bez jádra"}]
[null,null,null,{"$f":"zadání!B40","v":"průtok vzduchu:"},{"$f":"zadání!D40","v":10000},null,"m3/h",null,null,null,null,{"$f":"zadání!J40","v":"hustota vzduchu:"},{"$f":"zadání!L40","v":1.2},null,"kg/m3"]
[null,{"$f":"IF(calc!Q7,lang!A68,lang!A67)","v":"hladina akustického výkonu zdroje s váhovým filtrem A:"}]
[null,{"$f":"lang!A61","v":"frekvence"}]
[null,16,20,25,31.5,40,50,63,80,100,125,160,200,250,315,400,500,630,800,1000,1250,1600,2000,2500,3150,4000,5000,6300,8000,10000,12500,16000,"Σ"]
[]
[null,{"$f":"lang!A35","v":"vložený útlum"}]
[null,{"$f":"zadání!C91","v":0.16666666666666666},{"$f":"zadání!D91","v":0.19999999999999998},{"$f":"zadání!E91","v":7.4083333333333341},{"$f":"zadání!F91","v":13.48833333333333},{"$f":"zadání!G91","v":12.736253333333327},{"$f":"zadání!H91","v":5.2758000000000012},{"$f":"zadání!I91","v":17.419600000000003},{"$f":"zadání!J91","v":15.170000000000009},{"$f":"zadání!K91","v":10.775000000000002},{"$f":"zadání!L91","v":24.320926666666672},{"$f":"zadání!M91","v":0.66666666666666663},{"$f":"zadání!N91","v":4.0166666666666648},{"$f":"zadání!O91","v":28.071666666666669},{"$f":"zadání!P91","v":9.6974133333333317},{"$f":"zadání!Q91","v":12.521400000000005},{"$f":"zadání!R91","v":46.776933333333339},{"$f":"zadání!S91","v":29.105360000000001},{"$f":"zadání!T91","v":36.619013333333342},{"$f":"zadání!U91","v":102.76046666666666},{"$f":"zadání!V91","v":38.22},{"$f":"zadání!W91","v":26.695186666666675},{"$f":"zadání!X91","v":71.904093333333336},{"$f":"zadání!Y91","v":16.25732},{"$f":"zadání!Z91","v":12.178266666666657},{"$f":"zadání!AA91","v":60.808533333333337},{"$f":"zadání!AB91","v":10.487399999999999},{"$f":"zadání!AC91","v":17.134033333333324},{"$f":"zadání!AD91","v":48.951866666666668},{"$f":"zadání!AE91","v":7.8318933333333343},{"$f":"zadání!AF91","v":6.5626933333333319},{"$f":"zadání!AG91","v":7.8940000000000028},"-","dB"]
[]
[null,{"$f":"lang!A31","v":"hladina akustického výkonu zdroje:"}]
[null,{"$f":"zadání!C48","v":15},{"$f":"zadání!D48","v":25},{"$f":"zadání!E48","v":48},{"$f":"zadání!F48","v":36},{"$f":"zadání!G48","v":27},{"$f":"zadání!H48","v":55},{"$f":"zadání!I48","v":42},{"$f":"zadání!J48","v":45},{"$f":"zadání!K48","v":48},{"$f":"zadání!L48","v":53},{"$f":"zadání!M48","v":56},{"$f":"zadání!N48","v":58},{"$f":"zadání!O48","v":61},{"$f":"zadání!P48","v":64},{"$f":"zadání!Q48","v":70},{"$f":"zadání!R48","v":75},{"$f":"zadání!S48","v":73},{"$f":"zadání!T48","v":78},{"$f":"zadání!U48","v":80},{"$f":"zadání!V48","v":81},{"$f":"zadání!W48","v":77},{"$f":"zadání!X48","v":75},{"$f":"zadání!Y48","v":70},{"$f":"zadání!Z48","v":68},{"$f":"zadání!AA48","v":67},{"$f":"zadání!AB48","v":60},{"$f":"zadání!AC48","v":58},{"$f":"zadání!AD48","v":55},{"$f":"zadání!AE48","v":51},{"$f":"zadání!AF48","v":45},{"$f":"zadání!AG48","v":41},{"$f":"zadání!AH48","v":86.639251127389684},{"$f":"zadání!AI92","v":"dB(A)"}]
[]
[null,{"$f":"lang!A36","v":"vlastní hluk tlumiče"}]
[null,{"$f":"zadání!C92","v":0},{"$f":"zadání!D92","v":0},{"$f":"zadání!E92","v":0},{"$f":"zadání!F92","v":0},{"$f":"zadání!G92","v":0},{"$f":"zadání!H92","v":0},{"$f":"zadání!I92","v":0},{"$f":"zadání!J92","v":0},{"$f":"zadání!K92","v":0},{"$f":"zadání!L92","v":0},{"$f":"zadání!M92","v":0},{"$f":"zadání!N92","v":0},{"$f":"zadání!O92","v":0},{"$f":"zadání!P92","v":0},{"$f":"zadání!Q92","v":0},{"$f":"zadání!R92","v":0},{"$f":"zadání!S92","v":0},{"$f":"zadání!T92","v":0},{"$f":"zadání!U92","v":0},{"$f":"zadání!V92","v":0},{"$f":"zadání!W92","v":0},{"$f":"zadání!X92","v":0},{"$f":"zadání!Y92","v":0},{"$f":"zadání!Z92","v":0},{"$f":"zadání!AA92","v":0},{"$f":"zadání!AB92","v":0},{"$f":"zadání!AC92","v":0},{"$f":"zadání!AD92","v":0},{"$f":"zadání!AE92","v":0},{"$f":"zadání!AF92","v":0},{"$f":"zadání!AG92","v":0},{"$f":"zadání!AH92","v":"<15"},{"$f":"AH29","v":"dB(A)"}]
[]
[null,{"$f":"lang!A62","v":"akustický výkon za tlumičem"}]
[null,{"$f":"zadání!C93","v":14.973747635874805},{"$f":"zadání!D93","v":24.814357084593873},{"$f":"zadání!E93","v":40.592045631312828},{"$f":"zadání!F93","v":22.535955275921321},{"$f":"zadání!G93","v":14.42348106330634},{"$f":"zadání!H93","v":49.724246276659052},{"$f":"zadání!I93","v":24.595500421551314},{"$f":"zadání!J93","v":29.834513969219163},{"$f":"zadání!K93","v":37.225822703179055},{"$f":"zadání!L93","v":28.68495611602043},{"$f":"zadání!M93","v":55.333346052256459},{"$f":"zadání!N93","v":53.983350689352065},{"$f":"zadání!O93","v":32.930545614688654},{"$f":"zadání!P93","v":54.302602792599195},{"$f":"zadání!Q93","v":57.478607761111505},{"$f":"zadání!R93","v":28.229600242329987},{"$f":"zadání!S93","v":43.894817137884765},{"$f":"zadání!T93","v":41.381302654124646},{"$f":"zadání!U93","v":0},{"$f":"zadání!V93","v":42.780228966983664},{"$f":"zadání!W93","v":50.304853818968176},{"$f":"zadání!X93","v":4.8284707691685886},{"$f":"zadání!Y93","v":53.742698344901932},{"$f":"zadání!Z93","v":55.821744699405528},{"$f":"zadání!AA93","v":7.1269270173698329},{"$f":"zadání!AB93","v":49.512648587201099},{"$f":"zadání!AC93","v":40.86632243710266},{"$f":"zadání!AD93","v":7.0117407262180897},{"$f":"zadání!AE93","v":43.168316060156428},{"$f":"zadání!AF93","v":38.437928999232518},{"$f":"zadání!AG93","v":33.108123626448844},{"$f":"zadání!AH93","v":63.893495914499816},{"$f":"AH32","v":"dB(A)"}]
[null,null,null,{"$f":"zadání!$D$82","v":"tlaková ztráta:"},{"$f":"zadání!$E$82","v":3.9585767752205809},"Pa",null,null,null,null,null,null,{"$f":"zadání!K82","v":"rychlost v celkovém průřezu:"},{"$f":"zadání!L82","v":1.8518518518518519},"m/s",null,null,null,null,null,null,null,{"$f":"zadání!K84","v":"rychlost ve volné ploše:"},{"$f":"zadání!L84","v":3.0864197530864201},"m/s"]
[]
["Parametry prostoru"]
[null,null,null,null,null,null,null,{"$f":"zadání!F52","v":"vzdálenost k posluchači:"},{"$f":"zadání!H52","v":2},"m"]
[null,null,null,null,null,null,null,{"$f":"zadání!F54","v":"směrový činitel:"},{"$f":"zadání!H54","v":2}]
[null,null,null,null,null,null,null,{"$f":"zadání!L56","v":"celková plocha místnosti:"},{"$f":"zadání!N56","v":60},"m2"]
[null,null,null,null,null,null,null,{"$f":"zadání!F56","v":"střední hodnota součinitele zvukové pohltivosti:"},{"$f":"zadání!H56","v":0.4}]
[null,null,null,null,null,null,null,{"$f":"lang!A64","v":"počet vyústek:"},{"$f":"zadání!N58","v":1},{"$f":"zadání!O58","v":"ks"}]
[null,null,null,null,null,null,null,{"$f":"zadání!F58","v":"akustický výkon koncového elementu:"},{"$f":"zadání!H58","v":40},"dB"]
[null,null,null,null,null,null,null,null,null,null,null,null,{"$f":"zadání!B86","v":"hladina akustického tlaku v místě posluchače Lp:"},{"$f":"zadání!E86","v":""},{"$f":"zadání!E86","v":""}]
[null,null,null,null,null,null,null,null,{"$f":"zadání!D95","v":"Technické řešení:"}]
[null,null,null,null,null,null,null,null,{"$f":"zadání!D96","v":"Vysoké učení technické v Brně - Fakulta stavební - Ústav technických zařízení budov"},null,null,null,null,null,null,null,null,null,null,null,null,null,null,null,null,null,null,null,null,null,null,null,null,{"$f":"lang!B3","v":"v. 1.1.5"}]

{"sheet":"calc","index":3,"n_rows":58,"n_cols":35,"rows_kept":58,"cut":false,"hidden":true,"merged":[[47,3,47,4],[5,16,5,17],[27,3,27,4],[5,0,6,0],[32,0,35,0],[20,2,20,5],[5,1,9,1],[6,16,6,17],[22,8,23,8],[22,9,23,9],[22,10,23,10],[22,11,23,11],[22,12,23,12],[22,13,23,13]]}
["typ tlumiče",2,16,20,25,31.5,40,50,63,80,100,125,160,200,250,315,400,500,630,800,1000,1250,1600,2000,2500,3150,4000,5000,6300,8000,10000,12500,16000,"suma","Hz"]
["kulisa dB",1,{"$f":"db_kul!B60","v":0},{"$f":"db_kul!C60","v":0.21050087455589359},{"$f":"db_kul!D60","v":1.4145160039802125},{"$f":"db_kul!E60","v":1.5145200907230638},{"$f":"db_kul!F60","v":0.82803292518629235},{"$f":"db_kul!G60","v":1.2507431336917429},{"$f":"db_kul!H60","v":2.9777676560181598},{"$f":"db_kul!I60","v":3.6472768534280426},{"$f":"db_kul!J60","v":3.775158648283881},{"$f":"db_kul!K60","v":3.1704433295362371},{"$f":"db_kul!L60","v":1.8093363123502504},{"$f":"db_kul!M60","v":1.7158622276884892},{"$f":"db_kul!N60","v":2.8753332331660819},{"$f":"db_kul!O60","v":3.8150056846403544},{"$f":"db_kul!P60","v":5.1271972932062262},{"$f":"db_kul!Q60","v":6.7305916557408114},{"$f":"db_kul!R60","v":8.5425365330340526},{"$f":"db_kul!S60","v":10.213867061743581},{"$f":"db_kul!T60","v":10.743848818841428},{"$f":"db_kul!U60","v":11.069097254949375},{"$f":"db_kul!V60","v":10.368895441032388},{"$f":"db_kul!W60","v":8.9017830608517876},{"$f":"db_kul!X60","v":8.1087860744907516},{"$f":"db_kul!Y60","v":7.3129729389440445},{"$f":"db_kul!Z60","v":6.4673533340340938},{"$f":"db_kul!AA60","v":5.756584866662827},{"$f":"db_kul!AB60","v":5.2087620561124996},{"$f":"db_kul!AC60","v":4.9543392934315005},{"$f":"db_kul!AD60","v":4.9994291116238756},{"$f":"db_kul!AE60","v":4.9650505295200027},{"$f":"db_kul!AF60","v":3.2678412124431873}]
["buňka dB",2,{"$f":"db_bun!B24","v":0.16666666666666666},{"$f":"db_bun!C24","v":0.19999999999999998},{"$f":"db_bun!D24","v":7.4083333333333341},{"$f":"db_bun!E24","v":13.48833333333333},{"$f":"db_bun!F24","v":12.736253333333327},{"$f":"db_bun!G24","v":5.2758000000000012},{"$f":"db_bun!H24","v":17.419600000000003},{"$f":"db_bun!I24","v":15.170000000000009},{"$f":"db_bun!J24","v":10.775000000000002},{"$f":"db_bun!K24","v":24.320926666666672},{"$f":"db_bun!L24","v":0.66666666666666663},{"$f":"db_bun!M24","v":4.0166666666666648},{"$f":"db_bun!N24","v":28.071666666666669},{"$f":"db_bun!O24","v":9.6974133333333317},{"$f":"db_bun!P24","v":12.521400000000005},{"$f":"db_bun!Q24","v":46.776933333333339},{"$f":"db_bun!R24","v":29.105360000000001},{"$f":"db_bun!S24","v":36.619013333333342},{"$f":"db_bun!T24","v":102.76046666666666},{"$f":"db_bun!U24","v":38.22},{"$f":"db_bun!V24","v":26.695186666666675},{"$f":"db_bun!W24","v":71.904093333333336},{"$f":"db_bun!X24","v":16.25732},{"$f":"db_bun!Y24","v":12.178266666666657},{"$f":"db_bun!Z24","v":60.808533333333337},{"$f":"db_bun!AA24","v":10.487399999999999},{"$f":"db_bun!AB24","v":17.134033333333324},{"$f":"db_bun!AC24","v":48.951866666666668},{"$f":"db_bun!AD24","v":7.8318933333333343},{"$f":"db_bun!AE24","v":6.5626933333333319},{"$f":"db_bun!AF24","v":7.8940000000000028}]
["kruh db",3,{"$f":"db_kruh!D5","v":0},{"$f":"db_kruh!E5","v":2.8541999999999987},{"$f":"db_kruh!F5","v":3.4326999999999992},{"$f":"db_kruh!G5","v":8.0004000000000008},{"$f":"db_kruh!H5","v":3.5942000000000003},{"$f":"db_kruh!I5","v":0.9756999999999999},{"$f":"db_kruh!J5","v":2},{"$f":"db_kruh!K5","v":0},{"$f":"db_kruh!L5","v":0},{"$f":"db_kruh!M5","v":2},{"$f":"db_kruh!N5","v":2.2235999999999989},{"$f":"db_kruh!O5","v":4.8969000000000014},{"$f":"db_kruh!P5","v":1.4673000000000025},{"$f":"db_kruh!Q5","v":6.7759999999999989},{"$f":"db_kruh!R5","v":7.4133999999999975},{"$f":"db_kruh!S5","v":16.2606},{"$f":"db_kruh!T5","v":34.192},{"$f":"db_kruh!U5","v":40.0107},{"$f":"db_kruh!V5","v":47.011900000000004},{"$f":"db_kruh!W5","v":48.372799999999998},{"$f":"db_kruh!X5","v":41.656800000000004},{"$f":"db_kruh!Y5","v":41.784300000000002},{"$f":"db_kruh!Z5","v":41.030999999999999},{"$f":"db_kruh!AA5","v":36.461800000000004},{"$f":"db_kruh!AB5","v":34.2363},{"$f":"db_kruh!AC5","v":28.513500000000001},{"$f":"db_kruh!AD5","v":27.382899999999999},{"$f":"db_kruh!AE5","v":18.5883},{"$f":"db_kruh!AF5","v":19.419899999999998},{"$f":"db_kruh!AG5","v":21.517599999999998},{"$f":"db_kruh!AH5","v":12.9534}]
["útlum do výpočtů",null,{"$f":"IF($B$1=1,C2,IF($B$1=2,C3,C4))","v":0.16666666666666666},{"$f":"IF($B$1=1,D2,IF($B$1=2,D3,D4))","v":0.19999999999999998},7.4083333333333341,13.48833333333333,12.736253333333327,5.2758000000000012,17.419600000000003,15.170000000000009,10.775000000000002,24.320926666666672,0.66666666666666663,4.0166666666666648,28.071666666666669,9.6974133333333317,12.521400000000005,46.776933333333339,29.105360000000001,36.619013333333342,102.76046666666666,38.22,26.695186666666675,71.904093333333336,16.25732,12.178266666666657,60.808533333333337,10.487399999999999,17.134033333333324,48.951866666666668,7.8318933333333343,6.5626933333333319,7.8940000000000028,{"$f":"10*LOG10(POWER(10,0.1*C5)+POWER(10,0.1*D5)+POWER(10,0.1*E5)+POWER(10,0.1*F5)+POWER(10,0.1*G5)+POWER(10,0.1*H5)+POWER(10,0.1*I5)+POWER(10,0.1*J5)+POWER(10,0.1*K5)+POWER(10,0.1*L5)+POWER(10,0.1*M5)+POWER(10,0.1*N5)+POWER(10,0.1*O5)+POWER(10,0.1*P5)+POWER(10,0.1*Q5)+POWER(10,0.1*R5)+POWER(10,0.1*S5)+POWER(10,0.1*T5)+POWER(10,0.1*U5)+POWER(10,0.1*V5)+POWER(10,0.1*W5)+POWER(10,0.1*X5)+POWER(10,0.1*Y5)+POWER(10,0.1*Z5)+POWER(10,0.1*AA5)+POWER(10,0.1*AB5)+POWER(10,0.1*AC5)+POWER(10,0.1*AD5)+POWER(10,0.1*AE5)+POWER(10,0.1*AF5)+POWER(10,0.1*AG5))","v":102.7643399077098},"dB"]
["vlastní hluk\nvýpočet","konstanty","B",58,"dB",null,"V",{"$f":"zadání!D40/3600","v":2.7777777777777777},"m3/s",null,{"$f":"10*LOG10((D7*D8*H7)/D9)","v":74.965175644245846},null,null,null,null,"dopočítat vlastní hluk:",true]
[null,null,"p",101325,"Pa",null,"S",{"$f":"IF(B1=1,zadání!D11/1000*zadání!L13/2000,IF(B1=2,(zadání!D24/1000*zadání!L26/1000)*zadání!L24*zadání!N24,db_kruh!K7))","v":0.89999999999999991},"m2",null,{"$f":"60*LOG10(H8/D8)","v":-122.82620716668855},null,null,null,null,"váhový filtr:",true]
[null,null,"c",344,"m/s",null,"v",{"$f":"IF(B1=1,$H$6/IF(db_kul!U5=0,-1,db_kul!U5),IF(B1=2,$H$6/IF(db_bun!Z12=0,-1,db_bun!Z12),$H$6/IF(db_kruh!K7=0,-1,db_kruh!K7)))","v":3.0864197530864201},"m/s"]
[null,null,"Wo",1,"W",null,"H",{"$f":"IF(B1=1,MAX(db_kul!G5,db_kul!N5),IF(B1=2,MAX(db_bun!G12,db_bun!N12),db_kruh!O7))","v":0.6},"m"]
[null,null,"δ",0.02,"m"]
[null,null,{"$f":"10*LOG10(1+POWER($D$8/(2*C1*$H$9),2))","v":25.078652378491878},23.148032002182983,21.22164888925413,19.233457389532855,17.190088537745247,15.298294435152961,13.365579388896338,11.41144806605238,9.6462623394165963,7.9653116370430119,6.2428925951507042,4.8493223040414364,3.6452181211887922,2.6202282544434805,1.8001430713682154,1.234305667302187,0.81724927487788768,0.5246414658300611,0.34298611570711618,0.22260798433716189,0.13722070264306618,8.8319228753811846E-2,5.673081964383711E-2,3.5819982279559411E-2,2.2248759872901869E-2,1.4252330484741848E-2,8.9827309408100856E-3,5.572884680816655E-3,3.5674699093310091E-3,2.2835183054851272E-3,1.3938917337525578E-3]
[null,null,{"$f":"10*LOG10(1+POWER((C1*$D$10)/$H$8,2))","v":4.6435533861719988E-2},7.2338974063376763E-2,0.11250631004955092,0.17728061415466223,0.28239565812308848,0.43352845278361163,0.66944269821902325,1.0337213931539875,1.5225898263682938,2.1908655716925232,3.1700852344106165,4.28072562301241,5.5923612173280857,7.1319621853234221,8.8753088288819661,10.606071955245556,12.471379743644,14.451970520891255,16.333714859866181,18.235394336568589,20.354114213784804,22.277880134713847,24.206817177038516,26.208122195395028,28.279159331006774,30.215035318434541,32.220916197729899,34.294915604910955,36.232534265161277,38.170362260500291,40.314303763804119]
["výsledek",null,{"$f":"$D$6+($K$6+$K$7+C11-C12)","v":35.171185322187455},{"$f":"$D$6+($K$6+$K$7+D11-D12)","v":33.214661505676901},31.248111056761879,29.195145252935493,27.046661357179456,25.003734459926648,22.835105168234612,20.516695150455689,18.262640990605597,15.913414542907788,13.211775838297392,10.707565158586327,8.1918253814180062,5.6272345466773572,3.0638027200435545,0.76720218961393272,-1.5151619912088137,-3.7883605775038944,-5.8517602666017723,-7.8738178746741312,-10.077925033584449,-12.050592428402737,-14.011117879837371,-16.033333735558159,-18.117942093576573,-20.061814510392495,-22.072964989231792,-24.150374242672839,-26.089998317694651,-28.029110264637509,-30.173941394513065]
["váhový filtr (A)",null,-56.7,-50.5,-44.7,-39.4,-34.6,-30.2,-26.2,-22.5,-19.100000000000001,-16.100000000000001,-13.4,-10.9,-8.6,-6.6,-4.8,-3.2,-1.9,-0.8,0,0.6,1,1.2,1.3,1.2,1,0.5,-0.1,-1.1000000000000001,-2.5,-4.5,-6.3]
["vlastní hluk (A)",null,{"$f":"IF($Q$7=TRUE,IF(C13+C14>0,C13+C14,0),IF(C13<0,0,C13))","v":0},{"$f":"IF($Q$7=TRUE,IF(D13+D14>0,D13+D14,0),IF(D13<0,0,D13))","v":0},0,0,0,0,0,0,0,0,0,0,0,0,0,0,0,0,0,0,0,0,0,0,0,0,0,0,0,0,0,{"$f":"10*LOG10(POWER(10,0.1*C15)+POWER(10,0.1*D15)+POWER(10,0.1*E15)+POWER(10,0.1*F15)+POWER(10,0.1*G15)+POWER(10,0.1*H15)+POWER(10,0.1*I15)+POWER(10,0.1*J15)+POWER(10,0.1*K15)+POWER(10,0.1*L15)+POWER(10,0.1*M15)+POWER(10,0.1*N15)+POWER(10,0.1*O15)+POWER(10,0.1*P15)+POWER(10,0.1*Q15)+POWER(10,0.1*R15)+POWER(10,0.1*S15)+POWER(10,0.1*T15)+POWER(10,0.1*U15)+POWER(10,0.1*V15)+POWER(10,0.1*W15)+POWER(10,0.1*X15)+POWER(10,0.1*Y15)+POWER(10,0.1*Z15)+POWER(10,0.1*AA15)+POWER(10,0.1*AB15)+POWER(10,0.1*AC15)+POWER(10,0.1*AD15)+POWER(10,0.1*AE15)+POWER(10,0.1*AF15)+POWER(10,0.1*AG15))","v":14.913616938342727},"dB"]
["zdroj hluku",null,{"$f":"zadání!C48","v":15},{"$f":"zadání!D48","v":25},{"$f":"zadání!E48","v":48},{"$f":"zadání!F48","v":36},{"$f":"zadání!G48","v":27},{"$f":"zadání!H48","v":55},{"$f":"zadání!I48","v":42},{"$f":"zadání!J48","v":45},{"$f":"zadání!K48","v":48},{"$f":"zadání!L48","v":53},{"$f":"zadání!M48","v":56},{"$f":"zadání!N48","v":58},{"$f":"zadání!O48","v":61},{"$f":"zadání!P48","v":64},{"$f":"zadání!Q48","v":70},{"$f":"zadání!R48","v":75},{"$f":"zadání!S48","v":73},{"$f":"zadání!T48","v":78},{"$f":"zadání!U48","v":80},{"$f":"zadání!V48","v":81},{"$f":"zadání!W48","v":77},{"$f":"zadání!X48","v":75},{"$f":"zadání!Y48","v":70},{"$f":"zadání!Z48","v":68},{"$f":"zadání!AA48","v":67},{"$f":"zadání!AB48","v":60},{"$f":"zadání!AC48","v":58},{"$f":"zadání!AD48","v":55},{"$f":"zadání!AE48","v":51},{"$f":"zadání!AF48","v":45},{"$f":"zadání!AG48","v":41},{"$f":"10*LOG10(POWER(10,0.1*C16)+POWER(10,0.1*D16)+POWER(10,0.1*E16)+POWER(10,0.1*F16)+POWER(10,0.1*G16)+POWER(10,0.1*H16)+POWER(10,0.1*I16)+POWER(10,0.1*J16)+POWER(10,0.1*K16)+POWER(10,0.1*L16)+POWER(10,0.1*M16)+POWER(10,0.1*N16)+POWER(10,0.1*O16)+POWER(10,0.1*P16)+POWER(10,0.1*Q16)+POWER(10,0.1*R16)+POWER(10,0.1*S16)+POWER(10,0.1*T16)+POWER(10,0.1*U16)+POWER(10,0.1*V16)+POWER(10,0.1*W16)+POWER(10,0.1*X16)+POWER(10,0.1*Y16)+POWER(10,0.1*Z16)+POWER(10,0.1*AA16)+POWER(10,0.1*AB16)+POWER(10,0.1*AC16)+POWER(10,0.1*AD16)+POWER(10,0.1*AE16)+POWER(10,0.1*AF16)+POWER(10,0.1*AG16))","v":86.639251127389684},{"$f":"IF(OR($G$34=1,ISERROR($K$6),$Q$6=FALSE),\"\",IF(AH16<15,\"<15\",AH16))","v":86.639251127389684}]
["utlumený zdroj",null,{"$f":"IF(C16-C5<0,0,C16-C5)","v":14.833333333333334},{"$f":"IF(D16-D5<0,0,D16-D5)","v":24.8},40.591666666666669,22.51166666666667,14.263746666666673,{"$f":"IF(H16-H5<0,0,H16-H5)","v":49.724199999999996},24.580399999999997,29.829999999999991,37.224999999999994,28.679073333333328,55.333333333333336,53.983333333333334,32.928333333333327,54.30258666666667,57.478599999999993,28.223066666666661,43.894639999999995,41.380986666666658,0,42.78,50.304813333333328,3.0959066666666644,53.74268,55.821733333333341,6.1914666666666633,49.512599999999999,40.865966666666679,6.0481333333333325,43.168106666666667,38.437306666666672,33.105999999999995]
["za tlumičem",null,{"$f":"IF(AND(C15=0,C17=0),0,10*LOG10(POWER(10,0.1*(C17))+POWER(10,0.1*C15)))","v":14.973747635874805},{"$f":"IF(AND(D15=0,D17=0),0,10*LOG10(POWER(10,0.1*(D17))+POWER(10,0.1*D15)))","v":24.814357084593873},40.592045631312828,22.535955275921321,14.42348106330634,49.724246276659052,24.595500421551314,29.834513969219163,37.225822703179055,28.68495611602043,55.333346052256459,53.983350689352065,32.930545614688654,54.302602792599195,57.478607761111505,28.229600242329987,43.894817137884765,41.381302654124646,0,42.780228966983664,50.304853818968176,4.8284707691685886,53.742698344901932,55.821744699405528,7.1269270173698329,49.512648587201099,40.86632243710266,7.0117407262180897,43.168316060156428,38.437928999232518,33.108123626448844,{"$f":"10*LOG10(POWER(10,0.1*C18)+POWER(10,0.1*D18)+POWER(10,0.1*E18)+POWER(10,0.1*F18)+POWER(10,0.1*G18)+POWER(10,0.1*H18)+POWER(10,0.1*I18)+POWER(10,0.1*J18)+POWER(10,0.1*K18)+POWER(10,0.1*L18)+POWER(10,0.1*M18)+POWER(10,0.1*N18)+POWER(10,0.1*O18)+POWER(10,0.1*P18)+POWER(10,0.1*Q18)+POWER(10,0.1*R18)+POWER(10,0.1*S18)+POWER(10,0.1*T18)+POWER(10,0.1*U18)+POWER(10,0.1*V18)+POWER(10,0.1*W18)+POWER(10,0.1*X18)+POWER(10,0.1*Y18)+POWER(10,0.1*Z18)+POWER(10,0.1*AA18)+POWER(10,0.1*AB18)+POWER(10,0.1*AC18)+POWER(10,0.1*AD18)+POWER(10,0.1*AE18)+POWER(10,0.1*AF18)+POWER(10,0.1*AG18))","v":63.893495914499816},"dB"]
["rychlost",null,null,null,"volný průřez",{"$f":"H8","v":3.0864197530864201},"m/s",null,"rychlost",null,null,"volný průřez",{"$f":"H8","v":3.0864197530864201},"m/s",null,"rychlost",null,null,"volný průřez",{"$f":"H8","v":3.0864197530864201},"m/s","výběr",{"$f":"IF($Q$6=TRUE,IF($B$1=1,F19,IF($B$1=2,M19,T19)),0)","v":3.0864197530864201},null,"vyhovuje:",{"$f":"IF(W19<AA19,1,0)","v":1},10,null,{"$f":"IF(G34=1,\"\",IF((Z19+Z20)<2,lang!A44,\"\"))","v":""}]
["kulisa",null,null,null,"celkový průřez",{"$f":"H6/(zadání!D9/1000*zadání!D11/1000)","v":9.2592592592592595},"m/s",null,"buňka",null,null,"celkový průřez",{"$f":"H6/(zadání!D22/1000*zadání!D24/1000*zadání!L24*zadání!N24)","v":1.8518518518518519},"m/s",null,"kruh",null,null,"celkový průřez",{"$f":"H6/(PI()*POWER(zadání!D32/2000,2))","v":180.44778128332803},"m/s",null,{"$f":"IF($Q$6=TRUE,IF($B$1=1,F20,IF($B$1=2,M20,T20)),0)","v":1.8518518518518519},null,null,{"$f":"IF(W20<AA20,1,0)","v":1},6]
["tlaková ztráta",null,{"$f":"zadání!L15","v":"bez úpravy"},null,null,null,null,null,"ksíS","ksíF","ro","ksí1","ksí2","dp"]
["kulisa",null,null,"náběh","náběh a odtok",null,null,null,{"$f":"(db_kul!C5/db_kul!G5)^2*(0.5*L22*(db_kul!G5/db_kul!C5+1)+M22)","v":0.39843749999999994},{"$f":"0.025*(db_kul!K5/db_kul!G5)*POWER(1+db_kul!C5/db_kul!G5,2)","v":0.17724609375},{"$f":"zadání!$L$40","v":1.2},{"$f":"IF(OR(D23,D24,E23,E24),0.1,1)","v":1},{"$f":"IF(OR(E23,E24),0.7,1)","v":1},{"$f":"0.5*(I22+J22)*$K$22*S41^2","v":1.1845341435185186},null,"výběr",{"$f":"IF($Q$6=TRUE,IF($B$1=1,N22,IF($B$1=2,N23,N25)),0)","v":3.9585767752205809},"Pa"]
["buňka",null,"CZ",{"$f":"IF(EXACT(C21,lang!B18)=TRUE,1,0)","v":0},{"$f":"IF(EXACT(C21,lang!B19)=TRUE,1,0)","v":0},null,null,null,{"$f":"(db_bun!C12/db_bun!G12)^2*(0.5*L23*(db_bun!G12/db_bun!C12+1)+M23)","v":0.1},{"$f":"0.025*db_bun!K12/db_bun!G12*POWER(1+db_bun!C12/db_bun!G12,2)","v":0.59259259259259278},{"$f":"zadání!$L$40","v":1.2},0.1,0.7,{"$f":"0.5*(I23+J23)*$K$23*H8^2","v":3.9585767752205809}]
[null,null,"EN",{"$f":"IF(EXACT(C21,lang!C18)=TRUE,1,0)","v":0},{"$f":"IF(EXACT(C21,lang!C19)=TRUE,1,0)","v":0}]
["kruh",null,null,null,null,null,null,null,{"$f":"IF(db_kruh!F7=1,POWER((db_kruh!S7-db_kruh!K7)/db_kruh!K7,2)*(0.5*L25*(db_kruh!K7/(db_kruh!S7-db_kruh!K7)+1)+M25),0)","v":0},{"$f":"0.025*db_kruh!C10/db_kruh!C7*(1+0.05/db_kruh!C7)^2","v":0.29600947521865895},{"$f":"zadání!$L$40","v":1.2},0.1,0.7,{"$f":"0.5*(I25+J25)*$K$25*H8^2","v":1.6918694285474338}]
["volitelná frekvence",null,null,{"$f":"zadání!L36","v":55},"Hz",{"$f":"COUNTIF(C1:AG1,D26)","v":0},null,{"$f":"INDEX(C1:AG1,MATCH(D26,C1:AG1))","v":50},"Hz",{"$f":"HLOOKUP(H26,C1:AG5,5,FALSE)","v":5.2758000000000012},"dB",{"$f":"LINEST(J26:J27,H26:H27)","v":0.93413846153846158},-41.431123076923079,{"$f":"D26*L26+M26","v":9.94649230769231},"dB","výběr",{"$f":"IF(F26=1,F27,N26)","v":9.94649230769231},"dB"]
[null,null,null,null,null,{"$f":"HLOOKUP(D26,C1:AG5,5,FALSE)","v":{"$error":"#N/A"}},"dB",{"$f":"INDEX(C1:AG1,MATCH(D26,C1:AG1)+1)","v":63},"Hz",{"$f":"HLOOKUP(H27,C1:AG5,5,FALSE)","v":17.419600000000003},"dB"]
["tlak v místě posluchače",null,null,false,null,"Q seznam:",null,1,2,3,4,8,null,null,null,null,null,null,"rezerva",0]
[null,null,null,null,"element",{"$f":"zadání!H58","v":40},null,"Q",{"$f":"zadání!H54","v":2},null,null,"výstup",{"$f":"10*LOG10(POWER(10,0.1*F29)+POWER(10,0.1*F31))","v":46.407073158168714},null,"posluchač",{"$f":"M30+10*LOG10((I29/(4*PI()*F32^2))+IF(I32=2,0,4/M31))+T31","v":39.555335676147884},"dB",null,null,3]
[null,null,null,null,"počet",{"$f":"zadání!N58","v":1},null,"alfa",{"$f":"zadání!H56","v":0.4},null,null,"všechny KE",{"$f":"M29+10*LOG10(F30)","v":46.407073158168714},null,null,null,null,null,null,5]
[null,null,null,null,"za tlumičem",{"$f":"IF(ISNUMBER(N47),N47,15)","v":45.279227834853586},null,"ploch",{"$f":"zadání!N56","v":60},null,null,"pohltivost",{"$f":"I30*I31","v":24},null,null,null,null,null,null,{"$f":"zadání!N54","v":0}]
[null,null,null,null,"vzdálenost",{"$f":"zadání!H52","v":2},null,"prostředí",{"$f":"IF(OR(zadání!N52=lang!B54,zadání!N52=lang!C54),1,2)","v":1}]
["podmínky použití",null,"průtočná mezera kulis",null,null,null,50,{"$f":"IF(zadání!L13<G33,\"změňte geometrii tlumiče\",\"mm\")","v":"mm"},null,"kulisy","min.","max.",null,"buňky","min.","max.",null,"min.","max."]
[null,null,"chyba geometrie",null,null,null,{"$f":"IF(zadání!L13<calc!G33,1,0)","v":0},null,null,"l",500,3000,null,"l",500,3000,"n",1,{"$f":"P35/200","v":2}]
[null,null,"šířka buňky",null,null,null,{"$f":"IF(db_bun!$B$12,200,250)","v":200},"mm",null,"a",200,3000,null,"a",200,400,"m",1,{"$f":"ROUNDDOWN(3000/zadání!D22,0)","v":12},{"$f":"ROUNDDOWN(3000/zadání!D24,0)","v":5}]
[null,null,"celkový rozměr tlumiče",null,null,null,{"$f":"CONCATENATE((db_bun!$B$12*2+db_bun!$F$12)*db_bun!$R$12,\" x \",db_bun!$M$12*db_bun!$U$12,\" x \",db_bun!$J$12,\" mm\")","v":"1250 x 1200 x 2000 mm"},null,null,"b",250,3000,null,"b",200,600,"D",50,80]
["kód","kulisa",null,{"$f":"CONCATENATE(lang!A57,\" KUTL \",zadání!D9,\"x\",zadání!D11,\"/\",zadání!D13,\"-\",zadání!L11,\"x\",zadání!L9,\" SP 402.\",1,1,IF(AND(D23,D24,E23,E24)=0,0,IF(OR(D23,D24)=1,2,3)))","v":"Tlumič hluku KUTL 1000x300/1000-2x100 SP 402.113"},null,null,null,null,null,null,null,null,"výběr",{"$f":"IF(G34=1,\"\",IF(B1=1,D37,D38))","v":"10x Buňkový tlumič hluku 250x600/2000 SP 403.111"},null,null,null,null,"tlumící plocha:",{"$f":"zadání!D11/1000*zadání!D13/1000*zadání!L11*2","v":1.2},null,"výběr",{"$f":"IF(G34=1,\"\",IF(B1=1,T37,T38))","v":24}]
[null,"buňka",null,{"$f":"CONCATENATE(zadání!L24*zadání!N24,\"x \",lang!A58,\" \",zadání!D22,\"x\",zadání!D24,\"/\",zadání!D26,\" SP 403.111\")","v":"10x Buňkový tlumič hluku 250x600/2000 SP 403.111"},null,null,null,null,null,null,null,null,null,null,null,null,null,null,null,{"$f":"zadání!D24/1000*zadání!D26/1000*2*zadání!L24*zadání!N24","v":24}]
[null,"kruh"]
[]
["Výstup",null,16,31.5,63,125,250,500,1000,2000,4000,8000,16000,"suma","Hz",null,null,"rychlost celkový",{"$f":"IF(OR(G34=1,Q6=FALSE),\"\",W20)","v":1.8518518518518519},"m/s"]
["útlum",null,null,null,{"$f":"IF($G$34=1,\"\",HLOOKUP(E41,$C$1:$AG$5,5,FALSE))","v":17.419600000000003},{"$f":"IF($G$34=1,\"\",HLOOKUP(F41,$C$1:$AG$5,5,FALSE))","v":24.320926666666672},28.071666666666669,46.776933333333339,102.76046666666666,71.904093333333336,60.808533333333337,48.951866666666668,null,null,"dB",null,null,"rychlost volný",{"$f":"IF(OR(G34=1,Q6=FALSE),\"\",W19)","v":3.0864197530864201},"m/s"]
["vlastní hluk",null,null,null,{"$f":"IF(OR($G$34=1,$Q$6=FALSE),\"\",HLOOKUP(E41,$C$1:$AG$15,15,FALSE))","v":0},{"$f":"IF(OR($G$34=1,$Q$6=FALSE),\"\",HLOOKUP(F41,$C$1:$AG$15,15,FALSE))","v":0},0,0,0,0,0,0,null,{"$f":"IF(OR($G$34=1,ISERROR($K$6),$Q$6=FALSE),\"\",IF(COUNTIF(E43:L43,\">0\")>1,IF(10*LOG10(POWER(10,0.1*E43)+POWER(10,0.1*F43)+POWER(10,0.1*G43)+POWER(10,0.1*H43)+POWER(10,0.1*I43)+POWER(10,0.1*J43)+POWER(10,0.1*K43)+POWER(10,0.1*L43))<15,\"< 15\",10*LOG10(POWER(10,0.1*E43)+POWER(10,0.1*F43)+POWER(10,0.1*G43)+POWER(10,0.1*H43)+POWER(10,0.1*I43)+POWER(10,0.1*J43)+POWER(10,0.1*K43)+POWER(10,0.1*L43))),0))","v":0},"dB",null,null,"tlak ztráta",{"$f":"IF(OR(G34=1,Q6=FALSE),\"\",Q22)","v":3.9585767752205809},"Pa"]
["zdroj hluku",null,null,null,{"$f":"IF($Q$6=TRUE,zadání!E44,\"\")","v":58},{"$f":"IF($Q$6=TRUE,zadání!F44,\"\")","v":65},{"$f":"IF($Q$6=TRUE,zadání!G44,\"\")","v":68},{"$f":"IF($Q$6=TRUE,zadání!H44,\"\")","v":75},{"$f":"IF($Q$6=TRUE,zadání!I44,\"\")","v":80},{"$f":"IF($Q$6=TRUE,zadání!J44,\"\")","v":77},{"$f":"IF($Q$6=TRUE,zadání!K44,\"\")","v":70},{"$f":"IF($Q$6=TRUE,zadání!L44,\"\")","v":68},null,{"$f":"IF(OR($G$34=1,ISERROR($K$6),$Q$6=FALSE),\"\",IF(COUNTIF(E44:L44,\">0\")>1,IF(10*LOG10(POWER(10,0.1*E44)+POWER(10,0.1*F44)+POWER(10,0.1*G44)+POWER(10,0.1*H44)+POWER(10,0.1*I44)+POWER(10,0.1*J44)+POWER(10,0.1*K44)+POWER(10,0.1*L44))<15,\"< 15\",10*LOG10(POWER(10,0.1*E44)+POWER(10,0.1*F44)+POWER(10,0.1*G44)+POWER(10,0.1*H44)+POWER(10,0.1*I44)+POWER(10,0.1*J44)+POWER(10,0.1*K44)+POWER(10,0.1*L44))),0))","v":83.183845144496871},"dB",null,null,"frekvence",{"$f":"IF(G34=1,\"\",Q26)","v":9.94649230769231},"dB"]
[null,null,null,null,{"$f":"IF(E44-E42<0,0,E44-E42)","v":40.580399999999997},40.679073333333328,39.928333333333327,28.223066666666661,0,5.0959066666666644,9.1914666666666633,{"$f":"IF(L44-L42<0,0,L44-L42)","v":19.048133333333332},null,null,null,null,null,"posluchač",{"$f":"IF(G34=1,\"\",IF(D28=TRUE,P29,\"\"))","v":""},"dB"]
[null,null,null,null,{"$f":"IF(AND(E43=0,E45=0),0,10*LOG10(POWER(10,0.1*(E45))+POWER(10,0.1*E43)))","v":40.580779949006917},40.679444747450681,39.928774831498345,28.229600242329987,0,6.2663678312627109,9.6854414978441437,19.1018713097736]
["za tlumičem",null,null,null,{"$f":"IF($G$34=1,\"\",IF($Q$6=TRUE,E46,\"\"))","v":40.580779949006917},40.679444747450681,39.928774831498345,28.229600242329987,0,6.2663678312627109,9.6854414978441437,19.1018713097736,null,{"$f":"IF(OR($G$34=1,ISERROR($K$6),$Q$6=FALSE),\"\",IF(COUNTIF(E47:L47,\">0\")>1,IF(10*LOG10(POWER(10,0.1*E47)+POWER(10,0.1*F47)+POWER(10,0.1*G47)+POWER(10,0.1*H47)+POWER(10,0.1*I47)+POWER(10,0.1*J47)+POWER(10,0.1*K47)+POWER(10,0.1*L47))<15,\"< 15\",10*LOG10(POWER(10,0.1*E47)+POWER(10,0.1*F47)+POWER(10,0.1*G47)+POWER(10,0.1*H47)+POWER(10,0.1*I47)+POWER(10,0.1*J47)+POWER(10,0.1*K47)+POWER(10,0.1*L47))),0))","v":45.279227834853586},"dB"]
["Výstup třetinooktávy",null,null,false,null,null,null,null,null,null,null,null,null,null,null,null,null,null,null,null,null,null,null,null,null,null,null,null,null,null,null,null,null,"suma"]
["útlum",null,{"$f":"IF($G$34=1,\"\",C5)","v":0.16666666666666666},0.19999999999999998,7.4083333333333341,13.48833333333333,12.736253333333327,5.2758000000000012,17.419600000000003,15.170000000000009,10.775000000000002,24.320926666666672,0.66666666666666663,4.0166666666666648,28.071666666666669,9.6974133333333317,12.521400000000005,46.776933333333339,29.105360000000001,36.619013333333342,102.76046666666666,38.22,26.695186666666675,71.904093333333336,16.25732,12.178266666666657,60.808533333333337,10.487399999999999,17.134033333333324,48.951866666666668,7.8318933333333343,6.5626933333333319,7.8940000000000028]
["hluk",null,{"$f":"IF(OR($G$34=1,$Q$6=FALSE),\"\",C15)","v":0},0,0,0,0,0,0,0,0,0,0,0,0,0,0,0,0,0,0,0,0,0,0,0,0,0,0,0,0,0,0,{"$f":"10*LOG10(POWER(10,0.1*C50)+POWER(10,0.1*D50)+POWER(10,0.1*E50)+POWER(10,0.1*F50)+POWER(10,0.1*G50)+POWER(10,0.1*H50)+POWER(10,0.1*I50)+POWER(10,0.1*J50)+POWER(10,0.1*K50)+POWER(10,0.1*L50)+POWER(10,0.1*M50)+POWER(10,0.1*N50)+POWER(10,0.1*O50)+POWER(10,0.1*P50)+POWER(10,0.1*Q50)+POWER(10,0.1*R50)+POWER(10,0.1*S50)+POWER(10,0.1*T50)+POWER(10,0.1*U50)+POWER(10,0.1*V50)+POWER(10,0.1*W50)+POWER(10,0.1*X50)+POWER(10,0.1*Y50)+POWER(10,0.1*Z50)+POWER(10,0.1*AA50)+POWER(10,0.1*AB50)+POWER(10,0.1*AC50)+POWER(10,0.1*AD50)+POWER(10,0.1*AE50)+POWER(10,0.1*AF50)+POWER(10,0.1*AG50))","v":14.913616938342727},{"$f":"IF(OR($G$34=1,ISERROR($K$6),$Q$6=FALSE),\"\",IF(AH50<15,\"<15\",AH50))","v":"<15"}]
["za tlumičem",null,{"$f":"IF(OR($G$34=1,$Q$6=FALSE),\"\",C18)","v":14.973747635874805},24.814357084593873,40.592045631312828,22.535955275921321,14.42348106330634,49.724246276659052,24.595500421551314,29.834513969219163,37.225822703179055,28.68495611602043,55.333346052256459,53.983350689352065,32.930545614688654,54.302602792599195,57.478607761111505,28.229600242329987,43.894817137884765,41.381302654124646,0,42.780228966983664,50.304853818968176,4.8284707691685886,53.742698344901932,55.821744699405528,7.1269270173698329,49.512648587201099,40.86632243710266,7.0117407262180897,43.168316060156428,38.437928999232518,33.108123626448844,{"$f":"10*LOG10(POWER(10,0.1*C51)+POWER(10,0.1*D51)+POWER(10,0.1*E51)+POWER(10,0.1*F51)+POWER(10,0.1*G51)+POWER(10,0.1*H51)+POWER(10,0.1*I51)+POWER(10,0.1*J51)+POWER(10,0.1*K51)+POWER(10,0.1*L51)+POWER(10,0.1*M51)+POWER(10,0.1*N51)+POWER(10,0.1*O51)+POWER(10,0.1*P51)+POWER(10,0.1*Q51)+POWER(10,0.1*R51)+POWER(10,0.1*S51)+POWER(10,0.1*T51)+POWER(10,0.1*U51)+POWER(10,0.1*V51)+POWER(10,0.1*W51)+POWER(10,0.1*X51)+POWER(10,0.1*Y51)+POWER(10,0.1*Z51)+POWER(10,0.1*AA51)+POWER(10,0.1*AB51)+POWER(10,0.1*AC51)+POWER(10,0.1*AD51)+POWER(10,0.1*AE51)+POWER(10,0.1*AF51)+POWER(10,0.1*AG51))","v":63.893495914499816},{"$f":"IF(OR($G$34=1,ISERROR($K$6),$Q$6=FALSE),\"\",IF(AH51<15,\"<15\",AH51))","v":63.893495914499816}]
["hlášení",null,{"$f":"IF(G34=0,\"\",lang!A63)","v":""}]
[]
[]
[null,null,"X","=","výsledek"]
[null,null,"X","=","vstup z jiných listů"]
[null,null,"X","=","výtupní hodnoty"]
[null,null,"X","=","výstup pro uživatele"]

{"sheet":"lang","index":4,"n_rows":82,"n_cols":3,"rows_kept":82,"cut":false,"hidden":true,"merged":[]}
["výběr","CZ","EN"]
[{"$f":"IF(zadání!$N$4=\"EN\",C2,B2)","v":"TLUMIČE HLUKU"},"TLUMIČE HLUKU","Sound Attenuators"]
[{"$f":"IF(zadání!$N$4=\"EN\",C3,B3)","v":"v. 1.1.5"},"v. 1.1.5",{"$f":"B3","v":"v. 1.1.5"}]
[{"$f":"IF(zadání!$N$4=\"EN\",C4,B4)","v":"Ján Skovajsa-KLIMAT, Beckov 587, 916 38 | klimat@klimat.sk| www.klimat.sk | tel.: +421 032 777 7441"},"Ján Skovajsa-KLIMAT, Beckov 587, 916 38 | klimat@klimat.sk| www.klimat.sk | tel.: +421 032 777 7441","Ján Skovajsa-KLIMAT, Beckov 587, 916 38 | klimat@klimat.sk| www.klimat.sk | tel.: +421 032 777 7441"]
[{"$f":"IF(zadání!$N$4=\"EN\",C5,B5)","v":"Typ tlumiče"},"Typ tlumiče","Attenuator type"]
[{"$f":"IF(zadání!$N$4=\"EN\",C6,B6)","v":"kulisový"},"kulisový","Sound Attenuator"]
[{"$f":"IF(zadání!$N$4=\"EN\",C7,B7)","v":"buňkový"},"buňkový","Cell Attenuator"]
[{"$f":"IF(zadání!$N$4=\"EN\",C8,B8)","v":"jazyk:"},"jazyk:","language:"]
[{"$f":"IF(zadání!$N$4=\"EN\",C9,B9)","v":"Kulisový tlumič"},"Kulisový tlumič","Sound Attenuator"]
[{"$f":"IF(zadání!$N$4=\"EN\",C10,B10)","v":"šířka tlumiče:"},"šířka tlumiče:","width:"]
[{"$f":"IF(zadání!$N$4=\"EN\",C11,B11)","v":"výška tlumiče:"},"výška tlumiče:","height:"]
[{"$f":"IF(zadání!$N$4=\"EN\",C12,B12)","v":"délka tlumiče:"},"délka tlumiče:","length:"]
[{"$f":"IF(zadání!$N$4=\"EN\",C13,B13)","v":"šířka kulisy:"},"šířka kulisy:","cell width:"]
[{"$f":"IF(zadání!$N$4=\"EN\",C14,B14)","v":"počet kulis:"},"počet kulis:","attenuation blocks"]
[{"$f":"IF(zadání!$N$4=\"EN\",C15,B15)","v":"průtočná mezera:"},"průtočná mezera:","flow gap:"]
[{"$f":"IF(zadání!$N$4=\"EN\",C16,B16)","v":"úprava hran:"},"úprava hran:","edge design:"]
[{"$f":"IF(zadání!$N$4=\"EN\",C17,B17)","v":"bez úpravy"},"bez úpravy","both flat"]
[{"$f":"IF(zadání!$N$4=\"EN\",C18,B18)","v":"pouze náběhová hrana"},"pouze náběhová hrana","leading edge only"]
[{"$f":"IF(zadání!$N$4=\"EN\",C19,B19)","v":"náběhová a výtoková hrana"},"náběhová a výtoková hrana","leading and discharge edge"]
[{"$f":"IF(zadání!$N$4=\"EN\",C20,B20)","v":"Buňkový tlumič"},"Buňkový tlumič","Cell Attenuator"]
[{"$f":"IF(zadání!$N$4=\"EN\",C21,B21)","v":"šířka buňky:"},"šířka buňky:","cell width:"]
[{"$f":"IF(zadání!$N$4=\"EN\",C22,B22)","v":"výška buňky:"},"výška buňky:","cell height:"]
[{"$f":"IF(zadání!$N$4=\"EN\",C23,B23)","v":"délka buňky:"},"délka buňky:","cell length:"]
[{"$f":"IF(zadání!$N$4=\"EN\",C24,B24)","v":"celkový rozměr:"},"celkový rozměr:","total dimensions:"]
[{"$f":"IF(zadání!$N$4=\"EN\",C25,B25)","v":"tloušťka izolace:"},"tloušťka izolace:","insulation width:"]
[{"$f":"IF(zadání!$N$4=\"EN\",C26,B26)","v":"počet buněk:"},"počet buněk:","number of cells:"]
[{"$f":"IF(zadání!$N$4=\"EN\",C27,B27)","v":"dopočítat vlastní hluk a tlakovou ztrátu"},"dopočítat vlastní hluk a tlakovou ztrátu","sound pressure level and pressure drop"]
[{"$f":"IF(zadání!$N$4=\"EN\",C28,B28)","v":"útlum ve frekvenci:"},"útlum ve frekvenci:","custom frequency:"]
[{"$f":"IF(zadání!$N$4=\"EN\",C29,B29)","v":"Okrajové podmínky před tlumičem"},"Okrajové podmínky před tlumičem","Boundary conditions in front of attenuator"]
[{"$f":"IF(zadání!$N$4=\"EN\",C30,B30)","v":"průtok vzduchu:"},"průtok vzduchu:","volume flow:"]
[{"$f":"IF(zadání!$N$4=\"EN\",C31,B31)","v":"hladina akustického výkonu zdroje:"},"hladina akustického výkonu zdroje:","sound power level of the source:"]
[{"$f":"IF(zadání!$N$4=\"EN\",C32,B32)","v":"hustota vzduchu:"},"hustota vzduchu:","air density:"]
[{"$f":"IF(zadání!$N$4=\"EN\",C33,B33)","v":"Výstup v oktávových pásmech"},"Výstup v oktávových pásmech","Results in octave bands"]
[{"$f":"IF(zadání!$N$4=\"EN\",C34,B34)","v":"součtová hladina"},"součtová hladina","sum level"]
[{"$f":"IF(zadání!$N$4=\"EN\",C35,B35)","v":"vložený útlum"},"vložený útlum","insertion loss"]
[{"$f":"IF(zadání!$N$4=\"EN\",C36,B36)","v":"vlastní hluk tlumiče"},"vlastní hluk tlumiče","generated noise"]
[{"$f":"IF(zadání!$N$4=\"EN\",C37,B37)","v":"     akustický výkon za tlumičem"},"     akustický výkon za tlumičem","     acoustic pwr. after attenuation"]
[{"$f":"IF(zadání!$N$4=\"EN\",C38,B38)","v":"tlaková ztráta:"},"tlaková ztráta:","pressure drop"]
[{"$f":"IF(zadání!$N$4=\"EN\",C39,B39)","v":"rychlost v celkovém průřezu:"},"rychlost v celkovém průřezu:","velocity in total cross-section:"]
[{"$f":"IF(zadání!$N$4=\"EN\",C40,B40)","v":"rychlost ve volné ploše:"},"rychlost ve volné ploše:","velocity in gap:"]
[{"$f":"IF(zadání!$N$4=\"EN\",C41,B41)","v":"Technické řešení:"},"Technické řešení:","Technical solution:"]
[{"$f":"IF(zadání!$N$4=\"EN\",C42,B42)","v":"Vysoké učení technické v Brně - Fakulta stavební - Ústav technických zařízení budov"},"Vysoké učení technické v Brně - Fakulta stavební - Ústav technických zařízení budov","Brno University of Technology - Faculty of Civil Engineering - Institute of Building Services"]
[{"$f":"IF(zadání!$N$4=\"EN\",C43,B43)","v":"kód výrobku:"},"kód výrobku:","product code:"]
[{"$f":"IF(zadání!$N$4=\"EN\",C44,B44)","v":"překročena doporučená rychlost"},"překročena doporučená rychlost","recommended velocity exceeded"]
[{"$f":"IF(zadání!$N$4=\"EN\",C45,B45)","v":"dopočítat hladinu akustického tlaku v místě posluchače"},"dopočítat hladinu akustického tlaku v místě posluchače","sum sound pressure level in place of the listener:"]
[{"$f":"IF(zadání!$N$4=\"EN\",C46,B46)","v":"vzdálenost k posluchači:"},"vzdálenost k posluchači:","distance to the listener:"]
[{"$f":"IF(zadání!$N$4=\"EN\",C47,B47)","v":"směrový činitel:"},"směrový činitel:","directional factor:"]
[{"$f":"IF(zadání!$N$4=\"EN\",C48,B48)","v":"střední hodnota součinitele zvukové pohltivosti:"},"střední hodnota součinitele zvukové pohltivosti:","mean value of sound absorption coefficient:"]
[{"$f":"IF(zadání!$N$4=\"EN\",C49,B49)","v":"akustický výkon koncového elementu:"},"akustický výkon koncového elementu:","diffuser sound power"]
[{"$f":"IF(zadání!$N$4=\"EN\",C50,B50)","v":"hladina akustického tlaku v místě posluchače Lp:"},"hladina akustického tlaku v místě posluchače Lp:","sum sound pressure level in place of the listener Lp:"]
[{"$f":"IF(zadání!$N$4=\"EN\",C51,B51)","v":"počet vyústek:"},"počet vyústek:","quantity of diffusers:"]
[{"$f":"IF(zadání!$N$4=\"EN\",C52,B52)","v":"celková plocha místnosti:"},"celková plocha místnosti:","total room area:"]
[{"$f":"IF(zadání!$N$4=\"EN\",C53,B53)","v":"prostředí:"},"prostředí:","environment:"]
[{"$f":"IF(zadání!$N$4=\"EN\",C54,B54)","v":"interiér"},"interiér","interior"]
[{"$f":"IF(zadání!$N$4=\"EN\",C55,B55)","v":"exteriér"},"exteriér","exterior"]
[{"$f":"IF(zadání!$N$4=\"EN\",C56,B56)","v":"ks"},"ks","pcs"]
[{"$f":"IF(zadání!$N$4=\"EN\",C57,B57)","v":"Tlumič hluku"},"Tlumič hluku","Sound Attenuator"]
[{"$f":"IF(zadání!$N$4=\"EN\",C58,B58)","v":"Buňkový tlumič hluku"},"Buňkový tlumič hluku","Cell Attenuator"]
[{"$f":"IF(zadání!$N$4=\"EN\",C59,B59)","v":"Rozšíření pro zobrazení hodnot v třetinooktávonývh pásmech."},"Rozšíření pro zobrazení hodnot v třetinooktávonývh pásmech.","Extension for displaying values in third octave bands."]
[{"$f":"IF(zadání!$N$4=\"EN\",C60,B60)","v":"Geometrie, průtok vzduchu a typ tlumiče jsou použity z karty ZADÁNÍ."},"Geometrie, průtok vzduchu a typ tlumiče jsou použity z karty ZADÁNÍ.","The geometry, air flow and attenuator type are used from the ZADÁNÍ tab."]
[{"$f":"IF(zadání!$N$4=\"EN\",C61,B61)","v":"frekvence"},"frekvence","frequency"]
[{"$f":"IF(zadání!$N$4=\"EN\",C62,B62)","v":"akustický výkon za tlumičem"},"akustický výkon za tlumičem","acoustic power behind attenuator"]
[{"$f":"IF(zadání!$N$4=\"EN\",C63,B63)","v":"opravte chyby v geometrii na kartě ZADÁNÍ"},"opravte chyby v geometrii na kartě ZADÁNÍ","fix the geometry errors in the ZADÁNÍ tab"]
[{"$f":"IF(zadání!$N$4=\"EN\",C64,B64)","v":"počet vyústek:"},"počet vyústek:","Qty. of diffusers:"]
[{"$f":"IF(zadání!$N$4=\"EN\",C65,B65)","v":"plocha tlumiče:"},"plocha tlumiče:","attenuator area:"]
[{"$f":"IF(zadání!$N$4=\"EN\",C66,B66)","v":"váhový filtr A"},"váhový filtr A","weight filter A"]
[{"$f":"IF(zadání!$N$4=\"EN\",C67,B67)","v":"hladina akustického výkonu zdroje bez váhového filtru A:"},"hladina akustického výkonu zdroje bez váhového filtru A:","Sound power level of the source without weight filter A:"]
[{"$f":"IF(zadání!$N$4=\"EN\",C68,B68)","v":"hladina akustického výkonu zdroje s váhovým filtrem A:"},"hladina akustického výkonu zdroje s váhovým filtrem A:","Sound power level of the source including weight filter A:"]
[{"$f":"IF(zadání!$N$4=\"EN\",C69,B69)","v":"rezerva Lp:"},"rezerva Lp:","reserve Lp:"]
[{"$f":"IF(zadání!$N$4=\"EN\",C70,B70)","v":"přidat zadání v třetinooktávových pásmech:"},"přidat zadání v třetinooktávových pásmech:","Add input in third octave bands"]
[{"$f":"IF(zadání!$N$4=\"EN\",C71,B71)","v":"Výstup v třetinooktávových pásmech"},"Výstup v třetinooktávových pásmech","Results in third octave bands"]
[{"$f":"IF(zadání!$N$4=\"EN\",C72,B72)","v":" - výrobní parametry"}," - výrobní parametry"," - production parameters"]
[{"$f":"IF(zadání!$N$4=\"EN\",C73,B73)","v":"Hladina akustického tlaku v prostoru za tlumičem"},"Hladina akustického tlaku v prostoru za tlumičem","Sound pressure level in the space behind the attenuator"]
[{"$f":"IF(zadání!$N$4=\"EN\",C74,B74)","v":"Akustické charakteristiky zdroje hluku a tlumiče"},"Akustické charakteristiky zdroje hluku a tlumiče","Acoustic characteristics of noise source and attenuator"]
[{"$f":"IF(zadání!$N$4=\"EN\",C75,B75)","v":"hladina akust. výkonu zdroje"},"hladina akust. výkonu zdroje","power level of the source"]
[{"$f":"IF(zadání!$N$4=\"EN\",C76,B76)","v":"průměr tlumiče:"},"průměr tlumiče:","diameter:"]
[{"$f":"IF(zadání!$N$4=\"EN\",C77,B77)","v":"provedení:"},"provedení:","design:"]
[{"$f":"IF(zadání!$N$4=\"EN\",C78,B78)","v":"bez jádra"},"bez jádra","without core"]
[{"$f":"IF(zadání!$N$4=\"EN\",C79,B79)","v":"s jádrem"},{"$f":"IF(db_kruh!F74,\"s jádrem\",\"\")","v":"s jádrem"},{"$f":"IF(db_kruh!F74,\"with core\",\"\")","v":"with core"}]
[{"$f":"IF(zadání!$N$4=\"EN\",C80,B80)","v":"kruhový"},"kruhový","circular"]
[{"$f":"IF(zadání!$N$4=\"EN\",C81,B81)","v":"Kruhový tlumič"},"Kruhový tlumič","Circular Attenuator"]
[{"$f":"IF(zadání!$N$4=\"EN\",C82,B82)","v":"Air Technology s.r.o. | info@airtechnology.cz | www.airtechnology.cz | +420 518 321 001"},"Air Technology s.r.o. | info@airtechnology.cz | www.airtechnology.cz | +420 518 321 001","Air Technology s.r.o. | info@airtechnology.cz | www.airtechnology.cz | +420 518 321 001"]

{"sheet":"db_kul","index":5,"n_rows":60,"n_cols":16384,"rows_kept":60,"cut":false,"hidden":true,"merged":[]}
[1,2,3,4,5,6,7,8,9,10,11,12,13,14,15,16,17,18,19,20,21,22,23,24,25,26,27,28,29,30,31,32]
["alfy",16,20,25,31.5,40,50,63,80,100,125,160,200,250,315,400,500,630,800,1000,1250,1600,2000,2500,3150,4000,5000,6300,8000,10000,12500,16000]
[100,0,0.1,0.25,0.3,0.25,0.15,0.5,0.65,0.7,0.41,0.2,0.4,0.7,0.6,0.7,0.8,1.1000000000000001,1.3,1.25,1.2,1.2,1.2,1,0.85,0.8,0.8,0.9,0.7,0.7,0.7,0.55000000000000004]
[200,0.15440231106401939,0,0.30330082075430292,0.45,0.35,0.15,0.28000000000000003,0.8793669863370801,0.29053180494390801,0.55001936704342136,0.44663455171104582,0.68230188770777256,0.96046836161235438,1.1490993474011788,1.0495433571760064,1.3827196395957588,1.3989540836465975,1.3868786154997583,1.3000910166572135,1.1958381817845596,1.2,1.1000000000000001,1.0410870773577869,0.86846460190787234,0.9,0.9,0.69906473258468227,0.60695959643149033,0.66721356513975671,0.71532381117907384,0.63156260951176901]
["izolace",{"$f":"zadání!L9","v":100},{"$f":"B5/1000","v":0.1},null,"pr. mezera",{"$f":"(zadání!D9-B5*Q5)/(Q5+1)","v":266.66666666666669},{"$f":"F5/1000","v":0.26666666666666666},null,"délka",{"$f":"zadání!D13","v":1000},{"$f":"J5/1000","v":1},"výška",{"$f":"zadání!D11","v":300},{"$f":"M5/1000","v":0.3},null,"počet kulis",{"$f":"zadání!L11","v":2},null,null,"průt. plocha",{"$f":"G5*N5*(Q5+1)","v":0.24}]
["alfa",{"$f":"VLOOKUP($B$5,$A$3:$AF$4,B1)","v":0},0.1,0.25,0.3,0.25,0.15,0.5,0.65,0.7,0.41,0.2,0.4,0.7,0.6,0.7,0.8,1.1000000000000001,1.3,1.25,1.2,1.2,1.2,1,0.85,0.8,0.8,0.9,0.7,0.7,0.7,0.55000000000000004]
["délka 100 ax",1,1.0143020594965675,-3.5619914564686757,0.39947666812036675,0.33667820069204135,1.1141199226305616,-7.575757575757569E-3,0.4123618990743505,0.7239057239057245,0.60105448154657271,1.9554030874785591,1.1867283950617287,0.95877277085330825,0.89326334208224056,1.1291648636953702,0.88676540850453911,0.88494516450648053,0.80096590077564767,0.84475218658892159,0.71661388229084189,0.71311590145576709,0.74031855090568421,0.66215716890732201,0.62817105581058186,0.60932979749276783,0.53907922912205564,0.55029669398135084,0.47595244528505803,0.48077524226320706,0.46031746031746029,0.2326007326007325]
["délka 100 b",-0.33333333333333348,-0.3428680396643784,5.0803571428571459,0.60052333187963325,0.68004613610149955,-0.11411992263056148,1.0427609427609426,0.58415447397233011,0.2760942760942755,0.39562585432532743,-0.97026872498570604,-0.13425925925925941,4.474272930648393E-3,0.10673665791775944,-0.1107745564690612,0.11323459149546089,0.11505483549351947,0.1901068344797307,0.13388991960420493,0.24364388141110227,0.26250470503639822,0.24672079950031212,0.32381124084578328,0.36777870715043343,0.38805850208936021,0.46092077087794436,0.43797682961288487,0.51643699900927675,0.51922475773679289,0.53968253968253965,0.75353218210361084]
["fakt. délky 100",{"$f":"B7*$K$5+B8","v":0.66666666666666652},{"$f":"C7*$K$5+C8","v":0.67143401983218909},1.5183656863884702,1,1.016724336793541,1,1.035185185185185,0.99651637304668061,1,0.99668033587190008,0.98513436249285302,1.0524691358024691,0.96324704378395665,1,1.018390307226309,1,1,0.99107273525537831,0.97864210619312653,0.96025776370194416,0.97562060649216531,0.98703935040599633,0.98596840975310529,0.99594976296101523,0.99738829958212805,1,0.9882735235942357,0.99238944429433484,1,1,0.98613291470434339]
["délka 200 ax",-0.65457685664939491,0,0.28389261744966454,-0.33558916839673947,-1.1031916455017683,-7.7491612677829123,1.3359850581073609,0.42686681782130081,1.6111940298507466,1.0556742234333354,1.2159989068221133,0.9413260012450716,0.79231146657943941,0.89332673720705824,1.1358152768019525,0.8618773801592392,0.83686893406193197,0.85297998449876644,0.85620138779068,0.86778686763438628,0.72489427824000319,0.68411064210945971,0.78172522741845607,0.68771535216377777,0.68938783729359665,0.55968649668931003,0.60200595367903031,0.75311902784305296,0.75324526134405567,0.64052579632704432,0.61981042054678004]
["délka 200 b",1.03943580886586,0,9.9328859060402508E-2,1.2285141446550489,2.0855902135208613,8.6767537167097295,-0.22357498616491467,0.62686125235413792,-0.59900497512437867,-4.5993794228763485E-2,-0.24707942413542167,6.0235279004733189E-2,0.20528266309697119,0.11665833184855945,-0.12720049461888844,0.13121591694221013,0.15276745529856606,0.13668160239398597,0.12194846265070042,0.1257915760825617,0.27391082000747424,0.32274783898789727,0.20233769299963372,0.33238928161798598,0.28136147811591289,0.41582396303760966,0.38164359128472097,0.23924246672716609,0.24752058204097216,0.35775412400610807,0.36233243659607706]
["fakt. délky 200",{"$f":"B10*$K$5+B11","v":0.38485895221646504},{"$f":"C10*$K$5+C11","v":0},0.38322147651006705,0.89292497625830947,0.98239856801909298,0.92759244892681725,1.1124100719424463,1.0537280701754388,1.0121890547263679,1.0096804292045718,0.96891948268669159,1.0015612802498048,0.99759412967641059,1.0099850690556176,1.008614782183064,0.99309329710144933,0.98963638936049803,0.98966158689275241,0.97814985044138036,0.99357844371694792,0.99880509824747743,1.0068584810973569,0.98406292041808974,1.0201046337817639,0.97074931540950948,0.97551045972691974,0.98364954496375123,0.99236149457021905,1.0007658433850279,0.99827992033315238,0.9821428571428571]
["náběh 100, 200",{"$f":"(3.888*$G$5-1.24)*MAX(calc!$D$23:$D$24)","v":0},{"$f":"(3.888*$G$5-1.24)*MAX(calc!$D$23:$D$24)","v":0},{"$f":"(3.888*$G$5-1.24)*MAX(calc!$D$23:$D$24)","v":0},{"$f":"(3.888*$G$5-1.24)*MAX(calc!$D$23:$D$24)","v":0},{"$f":"(3.888*$G$5-1.24)*MAX(calc!$D$23:$D$24)","v":0},{"$f":"(3.888*$G$5-1.24)*MAX(calc!$D$23:$D$24)","v":0},{"$f":"(3.888*$G$5-1.24)*MAX(calc!$D$23:$D$24)","v":0},{"$f":"(3.888*$G$5-1.24)*MAX(calc!$D$23:$D$24)","v":0},{"$f":"(3.888*$G$5-1.24)*MAX(calc!$D$23:$D$24)","v":0},{"$f":"(3.888*$G$5-1.24)*MAX(calc!$D$23:$D$24)","v":0},{"$f":"(3.888*$G$5-1.24)*MAX(calc!$D$23:$D$24)","v":0},{"$f":"(3.888*$G$5-1.24)*MAX(calc!$D$23:$D$24)","v":0},{"$f":"(3.888*$G$5-1.24)*MAX(calc!$D$23:$D$24)","v":0},{"$f":"(3.888*$G$5-1.24)*MAX(calc!$D$23:$D$24)","v":0},{"$f":"(3.888*$G$5-1.24)*MAX(calc!$D$23:$D$24)","v":0},{"$f":"(3.888*$G$5-1.24)*MAX(calc!$D$23:$D$24)","v":0},{"$f":"(3.888*$G$5-1.24)*MAX(calc!$D$23:$D$24)","v":0},{"$f":"(3.888*$G$5-1.24)*MAX(calc!$D$23:$D$24)","v":0},{"$f":"(3.888*$G$5-1.24)*MAX(calc!$D$23:$D$24)","v":0},{"$f":"(3.888*$G$5-1.24)*MAX(calc!$D$23:$D$24)","v":0},{"$f":"(3.888*$G$5-1.24)*MAX(calc!$D$23:$D$24)","v":0},{"$f":"(3.888*$G$5-1.24)*MAX(calc!$D$23:$D$24)","v":0},{"$f":"(3.888*$G$5-1.24)*MAX(calc!$D$23:$D$24)","v":0},{"$f":"(3.888*$G$5-1.24)*MAX(calc!$D$23:$D$24)","v":0},{"$f":"(3.888*$G$5-1.24)*MAX(calc!$D$23:$D$24)","v":0},{"$f":"(3.888*$G$5-1.24)*MAX(calc!$D$23:$D$24)","v":0},{"$f":"(3.888*$G$5-1.24)*MAX(calc!$D$23:$D$24)","v":0},{"$f":"(3.888*$G$5-1.24)*MAX(calc!$D$23:$D$24)","v":0},{"$f":"(3.888*$G$5-1.24)*MAX(calc!$D$23:$D$24)","v":0},{"$f":"(3.888*$G$5-1.24)*MAX(calc!$D$23:$D$24)","v":0},{"$f":"(3.888*$G$5-1.24)*MAX(calc!$D$23:$D$24)","v":0}]
["náb+odb 100",{"$f":"(2.187*$G$5-1.26)*MAX(calc!$E$23:$E$24)","v":0},{"$f":"(2.187*$G$5-1.26)*MAX(calc!$E$23:$E$24)","v":0},{"$f":"(2.187*$G$5-1.26)*MAX(calc!$E$23:$E$24)","v":0},{"$f":"(2.187*$G$5-1.26)*MAX(calc!$E$23:$E$24)","v":0},{"$f":"(2.187*$G$5-1.26)*MAX(calc!$E$23:$E$24)","v":0},{"$f":"(2.187*$G$5-1.26)*MAX(calc!$E$23:$E$24)","v":0},{"$f":"(2.187*$G$5-1.26)*MAX(calc!$E$23:$E$24)","v":0},{"$f":"(2.187*$G$5-1.26)*MAX(calc!$E$23:$E$24)","v":0},{"$f":"(2.187*$G$5-1.26)*MAX(calc!$E$23:$E$24)","v":0},{"$f":"(2.187*$G$5-1.26)*MAX(calc!$E$23:$E$24)","v":0},{"$f":"(2.187*$G$5-1.26)*MAX(calc!$E$23:$E$24)","v":0},{"$f":"(2.187*$G$5-1.26)*MAX(calc!$E$23:$E$24)","v":0},{"$f":"(2.187*$G$5-1.26)*MAX(calc!$E$23:$E$24)","v":0},{"$f":"(2.187*$G$5-1.26)*MAX(calc!$E$23:$E$24)","v":0},{"$f":"(2.187*$G$5-1.26)*MAX(calc!$E$23:$E$24)","v":0},{"$f":"(2.187*$G$5-1.26)*MAX(calc!$E$23:$E$24)","v":0},{"$f":"(2.187*$G$5-1.26)*MAX(calc!$E$23:$E$24)","v":0},{"$f":"(2.187*$G$5-1.26)*MAX(calc!$E$23:$E$24)","v":0},{"$f":"(2.187*$G$5-1.26)*MAX(calc!$E$23:$E$24)","v":0},{"$f":"(2.187*$G$5-1.26)*MAX(calc!$E$23:$E$24)","v":0},{"$f":"(2.187*$G$5-1.26)*MAX(calc!$E$23:$E$24)","v":0},{"$f":"(2.187*$G$5-1.26)*MAX(calc!$E$23:$E$24)","v":0},{"$f":"(2.187*$G$5-1.26)*MAX(calc!$E$23:$E$24)","v":0},{"$f":"(2.187*$G$5-1.26)*MAX(calc!$E$23:$E$24)","v":0},{"$f":"(2.187*$G$5-1.26)*MAX(calc!$E$23:$E$24)","v":0},{"$f":"(2.187*$G$5-1.26)*MAX(calc!$E$23:$E$24)","v":0},{"$f":"(2.187*$G$5-1.26)*MAX(calc!$E$23:$E$24)","v":0},{"$f":"(2.187*$G$5-1.26)*MAX(calc!$E$23:$E$24)","v":0},{"$f":"(2.187*$G$5-1.26)*MAX(calc!$E$23:$E$24)","v":0},{"$f":"(2.187*$G$5-1.26)*MAX(calc!$E$23:$E$24)","v":0},{"$f":"(2.187*$G$5-1.26)*MAX(calc!$E$23:$E$24)","v":0}]
["náb+odb 200",{"$f":"2*B14","v":0},{"$f":"2*C14","v":0},0,0,0,0,0,0,0,0,0,0,0,0,0,0,0,0,0,0,0,0,0,0,0,0,0,0,0,0,0]
["utlum",{"$f":"1.05*B6^1.4*((2*$N$5)/($N$5*$G$5))*IF($B$5=100,B9,B12)+B13+IF($B$5=100,B14,B15)","v":0},{"$f":"1.05*C6^1.4*((2*$N$5)/($N$5*$G$5))*IF($B$5=100,C9,C12)+C13+IF($B$5=100,C14,C15)","v":0.21050087455589359},1.7168919136409058,1.4595545094655107,1.1496609860795646,0.55306773743045812,3.0890619399766601,4.2935220778400449,4.7795589061509425,2.2527025556550533,0.81505708016073353,2.2979676952935204,4.6038959869411764,3.8517874428879848,4.8674564628412993,5.7620436542843132,8.999125774376008,11.268776993972967,10.532912540806043,9.7609510323643285,9.9171132232485313,10.033183933017463,7.7645012268057041,6.2470429385247481,{"$f":"1.05*Z6^1.4*((2*$N$5)/($N$5*$G$5))*IF($B$5=100,Z9,Z12)+Z13+IF($B$5=100,Z14,Z15)","v":5.7469949224646228},5.7620436542843132,6.715328096265381,4.7431838068471723,4.7795589061509425,4.7795589061509425,3.3627438142747872,{"$f":"1.05*AG6^1.4*((2*$N$5)/($N$5*$G$5))*IF($B$5=100,AG9,AG12)+AG13+AG14","v":0},0,0,0,0,0,0,0,0,0,0,0,0,0,0,0,0,0,0,0,0,0,0,0,0,0,0,0,0,0,0,0,0,0,{"$f":"1.05*BO6^1.4*((2*$N$5)/($N$5*$G$5))*IF($B$5=100,BO9,BO12)+BO13+BO14","v":0},0,0,0,0,0,0,0,0,0,0,0,0,0,0,0,0,0,0,0,0,0,0,0,0,0,0,0,0,0,0,0,0,0,0,0,0,0,0,0,0,0,0,0,0,0,0,0,0,0,0,0,0,0,0,0,0,0,0,0,0,0,0,0,{"$f":"1.05*EA6^1.4*((2*$N$5)/($N$5*$G$5))*IF($B$5=100,EA9,EA12)+EA13+EA14","v":0},0,0,0,0,0,0,0,0,0,0,0,0,0,0,0,0,0,0,0,0,0,0,0,0,0,0,0,0,0,0,0,0,0,0,0,0,0,0,0,0,0,0,0,0,0,0,0,0,0,0,0,0,0,0,0,0,0,0,0,0,0,0,0,{"$f":"1.05*GM6^1.4*((2*$N$5)/($N$5*$G$5))*IF($B$5=100,GM9,GM12)+GM13+GM14","v":0},0,0,0,0,0,0,0,0,0,0,0,0,0,0,0,0,0,0,0,0,0,0,0,0,0,0,0,0,0,0,0,0,0,0,0,0,0,0,0,0,0,0,0,0,0,0,0,0,0,0,0,0,0,0,0,0,0,0,0,0,0,0,0,{"$f":"1.05*IY6^1.4*((2*$N$5)/($N$5*$G$5))*IF($B$5=100,IY9,IY12)+IY13+IY14","v":0},0,0,0,0,0,0,0,0,0,0,0,0,0,0,0,0,0,0,0,0,0,0,0,0,0,0,0,0,0,0,0,0,0,0,0,0,0,0,0,0,0,0,0,0,0,0,0,0,0,0,0,0,0,0,0,0,0,0,0,0,0,0,0,{"$f":"1.05*LK6^1.4*((2*$N$5)/($N$5*$G$5))*IF($B$5=100,LK9,LK12)+LK13+LK14","v":0},0,0,0,0,0,0,0,0,0,0,0,0,0,0,0,0,0,0,0,0,0,0,0,0,0,0,0,0,0,0,0,0,0,0,0,0,0,0,0,0,0,0,0,0,0,0,0,0,0,0,0,0,0,0,0,0,0,0,0,0,0,0,0,{"$f":"1.05*NW6^1.4*((2*$N$5)/($N$5*$G$5))*IF($B$5=100,NW9,NW12)+NW13+NW14","v":0},0,0,0,0,0,0,0,0,0,0,0,0,0,0,0,0,0,0,0,0,0,0,0,0,0,0,0,0,0,0,0,0,0,0,0,0,0,0,0,0,0,0,0,0,0,0,0,0,0,0,0,0,0,0,0,0,0,0,0,0,0,0,0,{"$f":"1.05*QI6^1.4*((2*$N$5)/($N$5*$G$5))*IF($B$5=100,QI9,QI12)+QI13+QI14","v":0},0,0,0,0,0,0,0,0,0,0,0,0,0,0,0,0,0,0,0,0,0,0,0,0,0,0,0,0,0,0,0,0,0,0,0,0,0,0,0,0,0,0,0,0,0,0,0,0,0,0,0,0,0,0,0,0,0,0,0,0,0,0,0,{"$f":"1.05*SU6^1.4*((2*$N$5)/($N$5*$G$5))*IF($B$5=100,SU9,SU12)+SU13+SU14","v":0},0,0,0,0,0,0,0,0,0,0,0,0,0,0,0,0,0,0,0,0,0,0,0,0,0,0,0,0,0,0,0,0,0,0,0,0,0,0,0,0,0,0,0,0,0,0,0,0,0,0,0,0,0,0,0,0,0,0,0,0,0,0,0,{"$f":"1.05*VG6^1.4*((2*$N$5)/($N$5*$G$5))*IF($B$5=100,VG9,VG12)+VG13+VG14","v":0},0,0,0,0,0,0,0,0,0,0,0,0,0,0,0,0,0,0,0,0,0,0,0,0,0,0,0,0,0,0,0,0,0,0,0,0,0,0,0,0,0,0,0,0,0,0,0,0,0,0,0,0,0,0,0,0,0,0,0,0,0,0,0,{"$f":"1.05*XS6^1.4*((2*$N$5)/($N$5*$G$5))*IF($B$5=100,XS9,XS12)+XS13+XS14","v":0},0,0,0,0,0,0,0,0,0,0,0,0,0,0,0,0,0,0,0,0,0,0,0,0,0,0,0,0,0,0,0,0,0,0,0,0,0,0,0,0,0,0,0,0,0,0,0,0,0,0,0,0,0,0,0,0,0,0,0,0,0,0,0,{"$f":"1.05*AAE6^1.4*((2*$N$5)/($N$5*$G$5))*IF($B$5=100,AAE9,AAE12)+AAE13+AAE14","v":0},0,0,0,0,0,0,0,0,0,0,0,0,0,0,0,0,0,0,0,0,0,0,0,0,0,0,0,0,0,0,0,0,0,0,0,0,0,0,0,0,0,0,0,0,0,0,0,0,0,0,0,0,0,0,0,0,0,0,0,0,0,0,0,{"$f":"1.05*ACQ6^1.4*((2*$N$5)/($N$5*$G$5))*IF($B$5=100,ACQ9,ACQ12)+ACQ13+ACQ14","v":0},0,0,0,0,0,0,0,0,0,0,0,0,0,0,0,0,0,0,0,0,0,0,0,0,0,0,0,0,0,0,0,0,0,0,0,0,0,0,0,0,0,0,0,0,0,0,0,0,0,0,0,0,0,0,0,0,0,0,0,0,0,0,0,{"$f":"1.05*AFC6^1.4*((2*$N$5)/($N$5*$G$5))*IF($B$5=100,AFC9,AFC12)+AFC13+AFC14","v":0},0,0,0,0,0,0,0,0,0,0,0,0,0,0,0,0,0,0,0,0,0,0,0,0,0,0,0,0,0,0,0,0,0,0,0,0,0,0,0,0,0,0,0,0,0,0,0,0,0,0,0,0,0,0,0,0,0,0,0,0,0,0,0,{"$f":"1.05*AHO6^1.4*((2*$N$5)/($N$5*$G$5))*IF($B$5=100,AHO9,AHO12)+AHO13+AHO14","v":0},0,0,0,0,0,0,0,0,0,0,0,0,0,0,0,0,0,0,0,0,0,0,0,0,0,0,0,0,0,0,0,0,0,0,0,0,0,0,0,0,0,0,0,0,0,0,0,0,0,0,0,0,0,0,0,0,0,0,0,0,0,0,0,{"$f":"1.05*AKA6^1.4*((2*$N$5)/($N$5*$G$5))*IF($B$5=100,AKA9,AKA12)+AKA13+AKA14","v":0},0,0,0,0,0,0,0,0,0,0,0,0,0,0,0,0,0,0,0,0,0,0,0,0,0,0,0,0,0,0,0,0,0,0,0,0,0,0,0,0,0,0,0,0,0,0,0,0,0,0,0,0,0,0,0,0,0,0,0,0,0,0,0,{"$f":"1.05*AMM6^1.4*((2*$N$5)/($N$5*$G$5))*IF($B$5=100,AMM9,AMM12)+AMM13+AMM14","v":0},0,0,0,0,0,0,0,0,0,0,0,0,0,0,0,0,0,0,0,0,0,0,0,0,0,0,0,0,0,0,0,0,0,0,0,0,0,0,0,0,0,0,0,0,0,0,0,0,0,0,0,0,0,0,0,0,0,0,0,0,0,0,0,{"$f":"1.05*AOY6^1.4*((2*$N$5)/($N$5*$G$5))*IF($B$5=100,AOY9,AOY12)+AOY13+AOY14","v":0},0,0,0,0,0,0,0,0,0,0,0,0,0,0,0,0,0,0,0,0,0,0,0,0,0,0,0,0,0,0,0,0,0,0,0,0,0,0,0,0,0,0,0,0,0,0,0,0,0,0,0,0,0,0,0,0,0,0,0,0,0,0,0,{"$f":"1.05*ARK6^1.4*((2*$N$5)/($N$5*$G$5))*IF($B$5=100,ARK9,ARK12)+ARK13+ARK14","v":0},0,0,0,0,0,0,0,0,0,0,0,0,0,0,0,0,0,0,0,0,0,0,0,0,0,0,0,0,0,0,0,0,0,0,0,0,0,0,0,0,0,0,0,0,0,0,0,0,0,0,0,0,0,0,0,0,0,0,0,0,0,0,0,{"$f":"1.05*ATW6^1.4*((2*$N$5)/($N$5*$G$5))*IF($B$5=100,ATW9,ATW12)+ATW13+ATW14","v":0},0,0,0,0,0,0,0,0,0,0,0,0,0,0,0,0,0,0,0,0,0,0,0,0,0,0,0,0,0,0,0,0,0,0,0,0,0,0,0,0,0,0,0,0,0,0,0,0,0,0,0,0,0,0,0,0,0,0,0,0,0,0,0,{"$f":"1.05*AWI6^1.4*((2*$N$5)/($N$5*$G$5))*IF($B$5=100,AWI9,AWI12)+AWI13+AWI14","v":0},0,0,0,0,0,0,0,0,0,0,0,0,0,0,0,0,0,0,0,0,0,0,0,0,0,0,0,0,0,0,0,0,0,0,0,0,0,0,0,0,0,0,0,0,0,0,0,0,0,0,0,0,0,0,0,0,0,0,0,0,0,0,0,{"$f":"1.05*AYU6^1.4*((2*$N$5)/($N$5*$G$5))*IF($B$5=100,AYU9,AYU12)+AYU13+AYU14","v":0},0,0,0,0,0,0,0,0,0,0,0,0,0,0,0,0,0,0,0,0,0,0,0,0,0,0,0,0,0,0,0,0,0,0,0,0,0,0,0,0,0,0,0,0,0,0,0,0,0,0,0,0,0,0,0,0,0,0,0,0,0,0,0,{"$f":"1.05*BBG6^1.4*((2*$N$5)/($N$5*$G$5))*IF($B$5=100,BBG9,BBG12)+BBG13+BBG14","v":0},0,0,0,0,0,0,0,0,0,0,0,0,0,0,0,0,0,0,0,0,0,0,0,0,0,0,0,0,0,0,0,0,0,0,0,0,0,0,0,0,0,0,0,0,0,0,0,0,0,0,0,0,0,0,0,0,0,0,0,0,0,0,0,{"$f":"1.05*BDS6^1.4*((2*$N$5)/($N$5*$G$5))*IF($B$5=100,BDS9,BDS12)+BDS13+BDS14","v":0},0,0,0,0,0,0,0,0,0,0,0,0,0,0,0,0,0,0,0,0,0,0,0,0,0,0,0,0,0,0,0,0,0,0,0,0,0,0,0,0,0,0,0,0,0,0,0,0,0,0,0,0,0,0,0,0,0,0,0,0,0,0,0,{"$f":"1.05*BGE6^1.4*((2*$N$5)/($N$5*$G$5))*IF($B$5=100,BGE9,BGE12)+BGE13+BGE14","v":0},0,0,0,0,0,0,0,0,0,0,0,0,0,0,0,0,0,0,0,0,0,0,0,0,0,0,0,0,0,0,0,0,0,0,0,0,0,0,0,0,0,0,0,0,0,0,0,0,0,0,0,0,0,0,0,0,0,0,0,0,0,0,0,{"$f":"1.05*BIQ6^1.4*((2*$N$5)/($N$5*$G$5))*IF($B$5=100,BIQ9,BIQ12)+BIQ13+BIQ14","v":0},0,0,0,0,0,0,0,0,0,0,0,0,0,0,0,0,0,0,0,0,0,0,0,0,0,0,0,0,0,0,0,0,0,0,0,0,0,0,0,0,0,0,0,0,0,0,0,0,0,0,0,0,0,0,0,0,0,0,0,0,0,0,0,{"$f":"1.05*BLC6^1.4*((2*$N$5)/($N$5*$G$5))*IF($B$5=100,BLC9,BLC12)+BLC13+BLC14","v":0},0,0,0,0,0,0,0,0,0,0,0,0,0,0,0,0,0,0,0,0,0,0,0,0,0,0,0,0,0,0,0,0,0,0,0,0,0,0,0,0,0,0,0,0,0,0,0,0,0,0,0,0,0,0,0,0,0,0,0,0,0,0,0,{"$f":"1.05*BNO6^1.4*((2*$N$5)/($N$5*$G$5))*IF($B$5=100,BNO9,BNO12)+BNO13+BNO14","v":0},0,0,0,0,0,0,0,0,0,0,0,0,0,0,0,0,0,0,0,0,0,0,0,0,0,0,0,0,0,0,0,0,0,0,0,0,0,0,0,0,0,0,0,0,0,0,0,0,0,0,0,0,0,0,0,0,0,0,0,0,0,0,0,{"$f":"1.05*BQA6^1.4*((2*$N$5)/($N$5*$G$5))*IF($B$5=100,BQA9,BQA12)+BQA13+BQA14","v":0},0,0,0,0,0,0,0,0,0,0,0,0,0,0,0,0,0,0,0,0,0,0,0,0,0,0,0,0,0,0,0,0,0,0,0,0,0,0,0,0,0,0,0,0,0,0,0,0,0,0,0,0,0,0,0,0,0,0,0,0,0,0,0,{"$f":"1.05*BSM6^1.4*((2*$N$5)/($N$5*$G$5))*IF($B$5=100,BSM9,BSM12)+BSM13+BSM14","v":0},0,0,0,0,0,0,0,0,0,0,0,0,0,0,0,0,0,0,0,0,0,0,0,0,0,0,0,0,0,0,0,0,0,0,0,0,0,0,0,0,0,0,0,0,0,0,0,0,0,0,0,0,0,0,0,0,0,0,0,0,0,0,0,{"$f":"1.05*BUY6^1.4*((2*$N$5)/($N$5*$G$5))*IF($B$5=100,BUY9,BUY12)+BUY13+BUY14","v":0},0,0,0,0,0,0,0,0,0,0,0,0,0,0,0,0,0,0,0,0,0,0,0,0,0,0,0,0,0,0,0,0,0,0,0,0,0,0,0,0,0,0,0,0,0,0,0,0,0,0,0,0,0,0,0,0,0,0,0,0,0,0,0,{"$f":"1.05*BXK6^1.4*((2*$N$5)/($N$5*$G$5))*IF($B$5=100,BXK9,BXK12)+BXK13+BXK14","v":0},0,0,0,0,0,0,0,0,0,0,0,0,0,0,0,0,0,0,0,0,0,0,0,0,0,0,0,0,0,0,0,0,0,0,0,0,0,0,0,0,0,0,0,0,0,0,0,0,0,0,0,0,0,0,0,0,0,0,0,0,0,0,0,{"$f":"1.05*BZW6^1.4*((2*$N$5)/($N$5*$G$5))*IF($B$5=100,BZW9,BZW12)+BZW13+BZW14","v":0},0,0,0,0,0,0,0,0,0,0,0,0,0,0,0,0,0,0,0,0,0,0,0,0,0,0,0,0,0,0,0,0,0,0,0,0,0,0,0,0,0,0,0,0,0,0,0,0,0,0,0,0,0,0,0,0,0,0,0,0,0,0,0,{"$f":"1.05*CCI6^1.4*((2*$N$5)/($N$5*$G$5))*IF($B$5=100,CCI9,CCI12)+CCI13+CCI14","v":0},0,0,0,0,0,0,0,0,0,0,0,0,0,0,0,0,0,0,0,0,0,0,0,0,0,0,0,0,0,0,0,0,0,0,0,0,0,0,0,0,0,0,0,0,0,0,0,0,0,0,0,0,0,0,0,0,0,0,0,0,0,0,0,{"$f":"1.05*CEU6^1.4*((2*$N$5)/($N$5*$G$5))*IF($B$5=100,CEU9,CEU12)+CEU13+CEU14","v":0},0,0,0,0,0,0,0,0,0,0,0,0,0,0,0,0,0,0,0,0,0,0,0,0,0,0,0,0,0,0,0,0,0,0,0,0,0,0,0,0,0,0,0,0,0,0,0,0,0,0,0,0,0,0,0,0,0,0,0,0,0,0,0,{"$f":"1.05*CHG6^1.4*((2*$N$5)/($N$5*$G$5))*IF($B$5=100,CHG9,CHG12)+CHG13+CHG14","v":0},0,0,0,0,0,0,0,0,0,0,0,0,0,0,0,0,0,0,0,0,0,0,0,0,0,0,0,0,0,0,0,0,0,0,0,0,0,0,0,0,0,0,0,0,0,0,0,0,0,0,0,0,0,0,0,0,0,0,0,0,0,0,0,{"$f":"1.05*CJS6^1.4*((2*$N$5)/($N$5*$G$5))*IF($B$5=100,CJS9,CJS12)+CJS13+CJS14","v":0},0,0,0,0,0,0,0,0,0,0,0,0,0,0,0,0,0,0,0,0,0,0,0,0,0,0,0,0,0,0,0,0,0,0,0,0,0,0,0,0,0,0,0,0,0,0,0,0,0,0,0,0,0,0,0,0,0,0,0,0,0,0,0,{"$f":"1.05*CME6^1.4*((2*$N$5)/($N$5*$G$5))*IF($B$5=100,CME9,CME12)+CME13+CME14","v":0},0,0,0,0,0,0,0,0,0,0,0,0,0,0,0,0,0,0,0,0,0,0,0,0,0,0,0,0,0,0,0,0,0,0,0,0,0,0,0,0,0,0,0,0,0,0,0,0,0,0,0,0,0,0,0,0,0,0,0,0,0,0,0,{"$f":"1.05*COQ6^1.4*((2*$N$5)/($N$5*$G$5))*IF($B$5=100,COQ9,COQ12)+COQ13+COQ14","v":0},0,0,0,0,0,0,0,0,0,0,0,0,0,0,0,0,0,0,0,0,0,0,0,0,0,0,0,0,0,0,0,0,0,0,0,0,0,0,0,0,0,0,0,0,0,0,0,0,0,0,0,0,0,0,0,0,0,0,0,0,0,0,0,{"$f":"1.05*CRC6^1.4*((2*$N$5)/($N$5*$G$5))*IF($B$5=100,CRC9,CRC12)+CRC13+CRC14","v":0},0,0,0,0,0,0,0,0,0,0,0,0,0,0,0,0,0,0,0,0,0,0,0,0,0,0,0,0,0,0,0,0,0,0,0,0,0,0,0,0,0,0,0,0,0,0,0,0,0,0,0,0,0,0,0,0,0,0,0,0,0,0,0,{"$f":"1.05*CTO6^1.4*((2*$N$5)/($N$5*$G$5))*IF($B$5=100,CTO9,CTO12)+CTO13+CTO14","v":0},0,0,0,0,0,0,0,0,0,0,0,0,0,0,0,0,0,0,0,0,0,0,0,0,0,0,0,0,0,0,0,0,0,0,0,0,0,0,0,0,0,0,0,0,0,0,0,0,0,0,0,0,0,0,0,0,0,0,0,0,0,0,0,{"$f":"1.05*CWA6^1.4*((2*$N$5)/($N$5*$G$5))*IF($B$5=100,CWA9,CWA12)+CWA13+CWA14","v":0},0,0,0,0,0,0,0,0,0,0,0,0,0,0,0,0,0,0,0,0,0,0,0,0,0,0,0,0,0,0,0,0,0,0,0,0,0,0,0,0,0,0,0,0,0,0,0,0,0,0,0,0,0,0,0,0,0,0,0,0,0,0,0,{"$f":"1.05*CYM6^1.4*((2*$N$5)/($N$5*$G$5))*IF($B$5=100,CYM9,CYM12)+CYM13+CYM14","v":0},0,0,0,0,0,0,0,0,0,0,0,0,0,0,0,0,0,0,0,0,0,0,0,0,0,0,0,0,0,0,0,0,0,0,0,0,0,0,0,0,0,0,0,0,0,0,0,0,0,0,0,0,0,0,0,0,0,0,0,0,0,0,0,{"$f":"1.05*DAY6^1.4*((2*$N$5)/($N$5*$G$5))*IF($B$5=100,DAY9,DAY12)+DAY13+DAY14","v":0},0,0,0,0,0,0,0,0,0,0,0,0,0,0,0,0,0,0,0,0,0,0,0,0,0,0,0,0,0,0,0,0,0,0,0,0,0,0,0,0,0,0,0,0,0,0,0,0,0,0,0,0,0,0,0,0,0,0,0,0,0,0,0,{"$f":"1.05*DDK6^1.4*((2*$N$5)/($N$5*$G$5))*IF($B$5=100,DDK9,DDK12)+DDK13+DDK14","v":0},0,0,0,0,0,0,0,0,0,0,0,0,0,0,0,0,0,0,0,0,0,0,0,0,0,0,0,0,0,0,0,0,0,0,0,0,0,0,0,0,0,0,0,0,0,0,0,0,0,0,0,0,0,0,0,0,0,0,0,0,0,0,0,{"$f":"1.05*DFW6^1.4*((2*$N$5)/($N$5*$G$5))*IF($B$5=100,DFW9,DFW12)+DFW13+DFW14","v":0},0,0,0,0,0,0,0,0,0,0,0,0,0,0,0,0,0,0,0,0,0,0,0,0,0,0,0,0,0,0,0,0,0,0,0,0,0,0,0,0,0,0,0,0,0,0,0,0,0,0,0,0,0,0,0,0,0,0,0,0,0,0,0,{"$f":"1.05*DII6^1.4*((2*$N$5)/($N$5*$G$5))*IF($B$5=100,DII9,DII12)+DII13+DII14","v":0},0,0,0,0,0,0,0,0,0,0,0,0,0,0,0,0,0,0,0,0,0,0,0,0,0,0,0,0,0,0,0,0,0,0,0,0,0,0,0,0,0,0,0,0,0,0,0,0,0,0,0,0,0,0,0,0,0,0,0,0,0,0,0,{"$f":"1.05*DKU6^1.4*((2*$N$5)/($N$5*$G$5))*IF($B$5=100,DKU9,DKU12)+DKU13+DKU14","v":0},0,0,0,0,0,0,0,0,0,0,0,0,0,0,0,0,0,0,0,0,0,0,0,0,0,0,0,0,0,0,0,0,0,0,0,0,0,0,0,0,0,0,0,0,0,0,0,0,0,0,0,0,0,0,0,0,0,0,0,0,0,0,0,{"$f":"1.05*DNG6^1.4*((2*$N$5)/($N$5*$G$5))*IF($B$5=100,DNG9,DNG12)+DNG13+DNG14","v":0},0,0,0,0,0,0,0,0,0,0,0,0,0,0,0,0,0,0,0,0,0,0,0,0,0,0,0,0,0,0,0,0,0,0,0,0,0,0,0,0,0,0,0,0,0,0,0,0,0,0,0,0,0,0,0,0,0,0,0,0,0,0,0,{"$f":"1.05*DPS6^1.4*((2*$N$5)/($N$5*$G$5))*IF($B$5=100,DPS9,DPS12)+DPS13+DPS14","v":0},0,0,0,0,0,0,0,0,0,0,0,0,0,0,0,0,0,0,0,0,0,0,0,0,0,0,0,0,0,0,0,0,0,0,0,0,0,0,0,0,0,0,0,0,0,0,0,0,0,0,0,0,0,0,0,0,0,0,0,0,0,0,0,{"$f":"1.05*DSE6^1.4*((2*$N$5)/($N$5*$G$5))*IF($B$5=100,DSE9,DSE12)+DSE13+DSE14","v":0},0,0,0,0,0,0,0,0,0,0,0,0,0,0,0,0,0,0,0,0,0,0,0,0,0,0,0,0,0,0,0,0,0,0,0,0,0,0,0,0,0,0,0,0,0,0,0,0,0,0,0,0,0,0,0,0,0,0,0,0,0,0,0,{"$f":"1.05*DUQ6^1.4*((2*$N$5)/($N$5*$G$5))*IF($B$5=100,DUQ9,DUQ12)+DUQ13+DUQ14","v":0},0,0,0,0,0,0,0,0,0,0,0,0,0,0,0,0,0,0,0,0,0,0,0,0,0,0,0,0,0,0,0,0,0,0,0,0,0,0,0,0,0,0,0,0,0,0,0,0,0,0,0,0,0,0,0,0,0,0,0,0,0,0,0,{"$f":"1.05*DXC6^1.4*((2*$N$5)/($N$5*$G$5))*IF($B$5=100,DXC9,DXC12)+DXC13+DXC14","v":0},0,0,0,0,0,0,0,0,0,0,0,0,0,0,0,0,0,0,0,0,0,0,0,0,0,0,0,0,0,0,0,0,0,0,0,0,0,0,0,0,0,0,0,0,0,0,0,0,0,0,0,0,0,0,0,0,0,0,0,0,0,0,0,{"$f":"1.05*DZO6^1.4*((2*$N$5)/($N$5*$G$5))*IF($B$5=100,DZO9,DZO12)+DZO13+DZO14","v":0},0,0,0,0,0,0,0,0,0,0,0,0,0,0,0,0,0,0,0,0,0,0,0,0,0,0,0,0,0,0,0,0,0,0,0,0,0,0,0,0,0,0,0,0,0,0,0,0,0,0,0,0,0,0,0,0,0,0,0,0,0,0,0,{"$f":"1.05*ECA6^1.4*((2*$N$5)/($N$5*$G$5))*IF($B$5=100,ECA9,ECA12)+ECA13+ECA14","v":0},0,0,0,0,0,0,0,0,0,0,0,0,0,0,0,0,0,0,0,0,0,0,0,0,0,0,0,0,0,0,0,0,0,0,0,0,0,0,0,0,0,0,0,0,0,0,0,0,0,0,0,0,0,0,0,0,0,0,0,0,0,0,0,{"$f":"1.05*EEM6^1.4*((2*$N$5)/($N$5*$G$5))*IF($B$5=100,EEM9,EEM12)+EEM13+EEM14","v":0},0,0,0,0,0,0,0,0,0,0,0,0,0,0,0,0,0,0,0,0,0,0,0,0,0,0,0,0,0,0,0,0,0,0,0,0,0,0,0,0,0,0,0,0,0,0,0,0,0,0,0,0,0,0,0,0,0,0,0,0,0,0,0,{"$f":"1.05*EGY6^1.4*((2*$N$5)/($N$5*$G$5))*IF($B$5=100,EGY9,EGY12)+EGY13+EGY14","v":0},0,0,0,0,0,0,0,0,0,0,0,0,0,0,0,0,0,0,0,0,0,0,0,0,0,0,0,0,0,0,0,0,0,0,0,0,0,0,0,0,0,0,0,0,0,0,0,0,0,0,0,0,0,0,0,0,0,0,0,0,0,0,0,{"$f":"1.05*EJK6^1.4*((2*$N$5)/($N$5*$G$5))*IF($B$5=100,EJK9,EJK12)+EJK13+EJK14","v":0},0,0,0,0,0,0,0,0,0,0,0,0,0,0,0,0,0,0,0,0,0,0,0,0,0,0,0,0,0,0,0,0,0,0,0,0,0,0,0,0,0,0,0,0,0,0,0,0,0,0,0,0,0,0,0,0,0,0,0,0,0,0,0,{"$f":"1.05*ELW6^1.4*((2*$N$5)/($N$5*$G$5))*IF($B$5=100,ELW9,ELW12)+ELW13+ELW14","v":0},0,0,0,0,0,0,0,0,0,0,0,0,0,0,0,0,0,0,0,0,0,0,0,0,0,0,0,0,0,0,0,0,0,0,0,0,0,0,0,0,0,0,0,0,0,0,0,0,0,0,0,0,0,0,0,0,0,0,0,0,0,0,0,{"$f":"1.05*EOI6^1.4*((2*$N$5)/($N$5*$G$5))*IF($B$5=100,EOI9,EOI12)+EOI13+EOI14","v":0},0,0,0,0,0,0,0,0,0,0,0,0,0,0,0,0,0,0,0,0,0,0,0,0,0,0,0,0,0,0,0,0,0,0,0,0,0,0,0,0,0,0,0,0,0,0,0,0,0,0,0,0,0,0,0,0,0,0,0,0,0,0,0,{"$f":"1.05*EQU6^1.4*((2*$N$5)/($N$5*$G$5))*IF($B$5=100,EQU9,EQU12)+EQU13+EQU14","v":0},0,0,0,0,0,0,0,0,0,0,0,0,0,0,0,0,0,0,0,0,0,0,0,0,0,0,0,0,0,0,0,0,0,0,0,0,0,0,0,0,0,0,0,0,0,0,0,0,0,0,0,0,0,0,0,0,0,0,0,0,0,0,0,{"$f":"1.05*ETG6^1.4*((2*$N$5)/($N$5*$G$5))*IF($B$5=100,ETG9,ETG12)+ETG13+ETG14","v":0},0,0,0,0,0,0,0,0,0,0,0,0,0,0,0,0,0,0,0,0,0,0,0,0,0,0,0,0,0,0,0,0,0,0,0,0,0,0,0,0,0,0,0,0,0,0,0,0,0,0,0,0,0,0,0,0,0,0,0,0,0,0,0,{"$f":"1.05*EVS6^1.4*((2*$N$5)/($N$5*$G$5))*IF($B$5=100,EVS9,EVS12)+EVS13+EVS14","v":0},0,0,0,0,0,0,0,0,0,0,0,0,0,0,0,0,0,0,0,0,0,0,0,0,0,0,0,0,0,0,0,0,0,0,0,0,0,0,0,0,0,0,0,0,0,0,0,0,0,0,0,0,0,0,0,0,0,0,0,0,0,0,0,{"$f":"1.05*EYE6^1.4*((2*$N$5)/($N$5*$G$5))*IF($B$5=100,EYE9,EYE12)+EYE13+EYE14","v":0},0,0,0,0,0,0,0,0,0,0,0,0,0,0,0,0,0,0,0,0,0,0,0,0,0,0,0,0,0,0,0,0,0,0,0,0,0,0,0,0,0,0,0,0,0,0,0,0,0,0,0,0,0,0,0,0,0,0,0,0,0,0,0,{"$f":"1.05*FAQ6^1.4*((2*$N$5)/($N$5*$G$5))*IF($B$5=100,FAQ9,FAQ12)+FAQ13+FAQ14","v":0},0,0,0,0,0,0,0,0,0,0,0,0,0,0,0,0,0,0,0,0,0,0,0,0,0,0,0,0,0,0,0,0,0,0,0,0,0,0,0,0,0,0,0,0,0,0,0,0,0,0,0,0,0,0,0,0,0,0,0,0,0,0,0,{"$f":"1.05*FDC6^1.4*((2*$N$5)/($N$5*$G$5))*IF($B$5=100,FDC9,FDC12)+FDC13+FDC14","v":0},0,0,0,0,0,0,0,0,0,0,0,0,0,0,0,0,0,0,0,0,0,0,0,0,0,0,0,0,0,0,0,0,0,0,0,0,0,0,0,0,0,0,0,0,0,0,0,0,0,0,0,0,0,0,0,0,0,0,0,0,0,0,0,{"$f":"1.05*FFO6^1.4*((2*$N$5)/($N$5*$G$5))*IF($B$5=100,FFO9,FFO12)+FFO13+FFO14","v":0},0,0,0,0,0,0,0,0,0,0,0,0,0,0,0,0,0,0,0,0,0,0,0,0,0,0,0,0,0,0,0,0,0,0,0,0,0,0,0,0,0,0,0,0,0,0,0,0,0,0,0,0,0,0,0,0,0,0,0,0,0,0,0,{"$f":"1.05*FIA6^1.4*((2*$N$5)/($N$5*$G$5))*IF($B$5=100,FIA9,FIA12)+FIA13+FIA14","v":0},0,0,0,0,0,0,0,0,0,0,0,0,0,0,0,0,0,0,0,0,0,0,0,0,0,0,0,0,0,0,0,0,0,0,0,0,0,0,0,0,0,0,0,0,0,0,0,0,0,0,0,0,0,0,0,0,0,0,0,0,0,0,0,{"$f":"1.05*FKM6^1.4*((2*$N$5)/($N$5*$G$5))*IF($B$5=100,FKM9,FKM12)+FKM13+FKM14","v":0},0,0,0,0,0,0,0,0,0,0,0,0,0,0,0,0,0,0,0,0,0,0,0,0,0,0,0,0,0,0,0,0,0,0,0,0,0,0,0,0,0,0,0,0,0,0,0,0,0,0,0,0,0,0,0,0,0,0,0,0,0,0,0,{"$f":"1.05*FMY6^1.4*((2*$N$5)/($N$5*$G$5))*IF($B$5=100,FMY9,FMY12)+FMY13+FMY14","v":0},0,0,0,0,0,0,0,0,0,0,0,0,0,0,0,0,0,0,0,0,0,0,0,0,0,0,0,0,0,0,0,0,0,0,0,0,0,0,0,0,0,0,0,0,0,0,0,0,0,0,0,0,0,0,0,0,0,0,0,0,0,0,0,{"$f":"1.05*FPK6^1.4*((2*$N$5)/($N$5*$G$5))*IF($B$5=100,FPK9,FPK12)+FPK13+FPK14","v":0},0,0,0,0,0,0,0,0,0,0,0,0,0,0,0,0,0,0,0,0,0,0,0,0,0,0,0,0,0,0,0,0,0,0,0,0,0,0,0,0,0,0,0,0,0,0,0,0,0,0,0,0,0,0,0,0,0,0,0,0,0,0,0,{"$f":"1.05*FRW6^1.4*((2*$N$5)/($N$5*$G$5))*IF($B$5=100,FRW9,FRW12)+FRW13+FRW14","v":0},0,0,0,0,0,0,0,0,0,0,0,0,0,0,0,0,0,0,0,0,0,0,0,0,0,0,0,0,0,0,0,0,0,0,0,0,0,0,0,0,0,0,0,0,0,0,0,0,0,0,0,0,0,0,0,0,0,0,0,0,0,0,0,{"$f":"1.05*FUI6^1.4*((2*$N$5)/($N$5*$G$5))*IF($B$5=100,FUI9,FUI12)+FUI13+FUI14","v":0},0,0,0,0,0,0,0,0,0,0,0,0,0,0,0,0,0,0,0,0,0,0,0,0,0,0,0,0,0,0,0,0,0,0,0,0,0,0,0,0,0,0,0,0,0,0,0,0,0,0,0,0,0,0,0,0,0,0,0,0,0,0,0,{"$f":"1.05*FWU6^1.4*((2*$N$5)/($N$5*$G$5))*IF($B$5=100,FWU9,FWU12)+FWU13+FWU14","v":0},0,0,0,0,0,0,0,0,0,0,0,0,0,0,0,0,0,0,0,0,0,0,0,0,0,0,0,0,0,0,0,0,0,0,0,0,0,0,0,0,0,0,0,0,0,0,0,0,0,0,0,0,0,0,0,0,0,0,0,0,0,0,0,{"$f":"1.05*FZG6^1.4*((2*$N$5)/($N$5*$G$5))*IF($B$5=100,FZG9,FZG12)+FZG13+FZG14","v":0},0,0,0,0,0,0,0,0,0,0,0,0,0,0,0,0,0,0,0,0,0,0,0,0,0,0,0,0,0,0,0,0,0,0,0,0,0,0,0,0,0,0,0,0,0,0,0,0,0,0,0,0,0,0,0,0,0,0,0,0,0,0,0,{"$f":"1.05*GBS6^1.4*((2*$N$5)/($N$5*$G$5))*IF($B$5=100,GBS9,GBS12)+GBS13+GBS14","v":0},0,0,0,0,0,0,0,0,0,0,0,0,0,0,0,0,0,0,0,0,0,0,0,0,0,0,0,0,0,0,0,0,0,0,0,0,0,0,0,0,0,0,0,0,0,0,0,0,0,0,0,0,0,0,0,0,0,0,0,0,0,0,0,{"$f":"1.05*GEE6^1.4*((2*$N$5)/($N$5*$G$5))*IF($B$5=100,GEE9,GEE12)+GEE13+GEE14","v":0},0,0,0,0,0,0,0,0,0,0,0,0,0,0,0,0,0,0,0,0,0,0,0,0,0,0,0,0,0,0,0,0,0,0,0,0,0,0,0,0,0,0,0,0,0,0,0,0,0,0,0,0,0,0,0,0,0,0,0,0,0,0,0,{"$f":"1.05*GGQ6^1.4*((2*$N$5)/($N$5*$G$5))*IF($B$5=100,GGQ9,GGQ12)+GGQ13+GGQ14","v":0},0,0,0,0,0,0,0,0,0,0,0,0,0,0,0,0,0,0,0,0,0,0,0,0,0,0,0,0,0,0,0,0,0,0,0,0,0,0,0,0,0,0,0,0,0,0,0,0,0,0,0,0,0,0,0,0,0,0,0,0,0,0,0,{"$f":"1.05*GJC6^1.4*((2*$N$5)/($N$5*$G$5))*IF($B$5=100,GJC9,GJC12)+GJC13+GJC14","v":0},0,0,0,0,0,0,0,0,0,0,0,0,0,0,0,0,0,0,0,0,0,0,0,0,0,0,0,0,0,0,0,0,0,0,0,0,0,0,0,0,0,0,0,0,0,0,0,0,0,0,0,0,0,0,0,0,0,0,0,0,0,0,0,{"$f":"1.05*GLO6^1.4*((2*$N$5)/($N$5*$G$5))*IF($B$5=100,GLO9,GLO12)+GLO13+GLO14","v":0},0,0,0,0,0,0,0,0,0,0,0,0,0,0,0,0,0,0,0,0,0,0,0,0,0,0,0,0,0,0,0,0,0,0,0,0,0,0,0,0,0,0,0,0,0,0,0,0,0,0,0,0,0,0,0,0,0,0,0,0,0,0,0,{"$f":"1.05*GOA6^1.4*((2*$N$5)/($N$5*$G$5))*IF($B$5=100,GOA9,GOA12)+GOA13+GOA14","v":0},0,0,0,0,0,0,0,0,0,0,0,0,0,0,0,0,0,0,0,0,0,0,0,0,0,0,0,0,0,0,0,0,0,0,0,0,0,0,0,0,0,0,0,0,0,0,0,0,0,0,0,0,0,0,0,0,0,0,0,0,0,0,0,{"$f":"1.05*GQM6^1.4*((2*$N$5)/($N$5*$G$5))*IF($B$5=100,GQM9,GQM12)+GQM13+GQM14","v":0},0,0,0,0,0,0,0,0,0,0,0,0,0,0,0,0,0,0,0,0,0,0,0,0,0,0,0,0,0,0,0,0,0,0,0,0,0,0,0,0,0,0,0,0,0,0,0,0,0,0,0,0,0,0,0,0,0,0,0,0,0,0,0,{"$f":"1.05*GSY6^1.4*((2*$N$5)/($N$5*$G$5))*IF($B$5=100,GSY9,GSY12)+GSY13+GSY14","v":0},0,0,0,0,0,0,0,0,0,0,0,0,0,0,0,0,0,0,0,0,0,0,0,0,0,0,0,0,0,0,0,0,0,0,0,0,0,0,0,0,0,0,0,0,0,0,0,0,0,0,0,0,0,0,0,0,0,0,0,0,0,0,0,{"$f":"1.05*GVK6^1.4*((2*$N$5)/($N$5*$G$5))*IF($B$5=100,GVK9,GVK12)+GVK13+GVK14","v":0},0,0,0,0,0,0,0,0,0,0,0,0,0,0,0,0,0,0,0,0,0,0,0,0,0,0,0,0,0,0,0,0,0,0,0,0,0,0,0,0,0,0,0,0,0,0,0,0,0,0,0,0,0,0,0,0,0,0,0,0,0,0,0,{"$f":"1.05*GXW6^1.4*((2*$N$5)/($N$5*$G$5))*IF($B$5=100,GXW9,GXW12)+GXW13+GXW14","v":0},0,0,0,0,0,0,0,0,0,0,0,0,0,0,0,0,0,0,0,0,0,0,0,0,0,0,0,0,0,0,0,0,0,0,0,0,0,0,0,0,0,0,0,0,0,0,0,0,0,0,0,0,0,0,0,0,0,0,0,0,0,0,0,{"$f":"1.05*HAI6^1.4*((2*$N$5)/($N$5*$G$5))*IF($B$5=100,HAI9,HAI12)+HAI13+HAI14","v":0},0,0,0,0,0,0,0,0,0,0,0,0,0,0,0,0,0,0,0,0,0,0,0,0,0,0,0,0,0,0,0,0,0,0,0,0,0,0,0,0,0,0,0,0,0,0,0,0,0,0,0,0,0,0,0,0,0,0,0,0,0,0,0,{"$f":"1.05*HCU6^1.4*((2*$N$5)/($N$5*$G$5))*IF($B$5=100,HCU9,HCU12)+HCU13+HCU14","v":0},0,0,0,0,0,0,0,0,0,0,0,0,0,0,0,0,0,0,0,0,0,0,0,0,0,0,0,0,0,0,0,0,0,0,0,0,0,0,0,0,0,0,0,0,0,0,0,0,0,0,0,0,0,0,0,0,0,0,0,0,0,0,0,{"$f":"1.05*HFG6^1.4*((2*$N$5)/($N$5*$G$5))*IF($B$5=100,HFG9,HFG12)+HFG13+HFG14","v":0},0,0,0,0,0,0,0,0,0,0,0,0,0,0,0,0,0,0,0,0,0,0,0,0,0,0,0,0,0,0,0,0,0,0,0,0,0,0,0,0,0,0,0,0,0,0,0,0,0,0,0,0,0,0,0,0,0,0,0,0,0,0,0,{"$f":"1.05*HHS6^1.4*((2*$N$5)/($N$5*$G$5))*IF($B$5=100,HHS9,HHS12)+HHS13+HHS14","v":0},0,0,0,0,0,0,0,0,0,0,0,0,0,0,0,0,0,0,0,0,0,0,0,0,0,0,0,0,0,0,0,0,0,0,0,0,0,0,0,0,0,0,0,0,0,0,0,0,0,0,0,0,0,0,0,0,0,0,0,0,0,0,0,{"$f":"1.05*HKE6^1.4*((2*$N$5)/($N$5*$G$5))*IF($B$5=100,HKE9,HKE12)+HKE13+HKE14","v":0},0,0,0,0,0,0,0,0,0,0,0,0,0,0,0,0,0,0,0,0,0,0,0,0,0,0,0,0,0,0,0,0,0,0,0,0,0,0,0,0,0,0,0,0,0,0,0,0,0,0,0,0,0,0,0,0,0,0,0,0,0,0,0,{"$f":"1.05*HMQ6^1.4*((2*$N$5)/($N$5*$G$5))*IF($B$5=100,HMQ9,HMQ12)+HMQ13+HMQ14","v":0},0,0,0,0,0,0,0,0,0,0,0,0,0,0,0,0,0,0,0,0,0,0,0,0,0,0,0,0,0,0,0,0,0,0,0,0,0,0,0,0,0,0,0,0,0,0,0,0,0,0,0,0,0,0,0,0,0,0,0,0,0,0,0,{"$f":"1.05*HPC6^1.4*((2*$N$5)/($N$5*$G$5))*IF($B$5=100,HPC9,HPC12)+HPC13+HPC14","v":0},0,0,0,0,0,0,0,0,0,0,0,0,0,0,0,0,0,0,0,0,0,0,0,0,0,0,0,0,0,0,0,0,0,0,0,0,0,0,0,0,0,0,0,0,0,0,0,0,0,0,0,0,0,0,0,0,0,0,0,0,0,0,0,{"$f":"1.05*HRO6^1.4*((2*$N$5)/($N$5*$G$5))*IF($B$5=100,HRO9,HRO12)+HRO13+HRO14","v":0},0,0,0,0,0,0,0,0,0,0,0,0,0,0,0,0,0,0,0,0,0,0,0,0,0,0,0,0,0,0,0,0,0,0,0,0,0,0,0,0,0,0,0,0,0,0,0,0,0,0,0,0,0,0,0,0,0,0,0,0,0,0,0,{"$f":"1.05*HUA6^1.4*((2*$N$5)/($N$5*$G$5))*IF($B$5=100,HUA9,HUA12)+HUA13+HUA14","v":0},0,0,0,0,0,0,0,0,0,0,0,0,0,0,0,0,0,0,0,0,0,0,0,0,0,0,0,0,0,0,0,0,0,0,0,0,0,0,0,0,0,0,0,0,0,0,0,0,0,0,0,0,0,0,0,0,0,0,0,0,0,0,0,{"$f":"1.05*HWM6^1.4*((2*$N$5)/($N$5*$G$5))*IF($B$5=100,HWM9,HWM12)+HWM13+HWM14","v":0},0,0,0,0,0,0,0,0,0,0,0,0,0,0,0,0,0,0,0,0,0,0,0,0,0,0,0,0,0,0,0,0,0,0,0,0,0,0,0,0,0,0,0,0,0,0,0,0,0,0,0,0,0,0,0,0,0,0,0,0,0,0,0,{"$f":"1.05*HYY6^1.4*((2*$N$5)/($N$5*$G$5))*IF($B$5=100,HYY9,HYY12)+HYY13+HYY14","v":0},0,0,0,0,0,0,0,0,0,0,0,0,0,0,0,0,0,0,0,0,0,0,0,0,0,0,0,0,0,0,0,0,0,0,0,0,0,0,0,0,0,0,0,0,0,0,0,0,0,0,0,0,0,0,0,0,0,0,0,0,0,0,0,{"$f":"1.05*IBK6^1.4*((2*$N$5)/($N$5*$G$5))*IF($B$5=100,IBK9,IBK12)+IBK13+IBK14","v":0},0,0,0,0,0,0,0,0,0,0,0,0,0,0,0,0,0,0,0,0,0,0,0,0,0,0,0,0,0,0,0,0,0,0,0,0,0,0,0,0,0,0,0,0,0,0,0,0,0,0,0,0,0,0,0,0,0,0,0,0,0,0,0,{"$f":"1.05*IDW6^1.4*((2*$N$5)/($N$5*$G$5))*IF($B$5=100,IDW9,IDW12)+IDW13+IDW14","v":0},0,0,0,0,0,0,0,0,0,0,0,0,0,0,0,0,0,0,0,0,0,0,0,0,0,0,0,0,0,0,0,0,0,0,0,0,0,0,0,0,0,0,0,0,0,0,0,0,0,0,0,0,0,0,0,0,0,0,0,0,0,0,0,{"$f":"1.05*IGI6^1.4*((2*$N$5)/($N$5*$G$5))*IF($B$5=100,IGI9,IGI12)+IGI13+IGI14","v":0},0,0,0,0,0,0,0,0,0,0,0,0,0,0,0,0,0,0,0,0,0,0,0,0,0,0,0,0,0,0,0,0,0,0,0,0,0,0,0,0,0,0,0,0,0,0,0,0,0,0,0,0,0,0,0,0,0,0,0,0,0,0,0,{"$f":"1.05*IIU6^1.4*((2*$N$5)/($N$5*$G$5))*IF($B$5=100,IIU9,IIU12)+IIU13+IIU14","v":0},0,0,0,0,0,0,0,0,0,0,0,0,0,0,0,0,0,0,0,0,0,0,0,0,0,0,0,0,0,0,0,0,0,0,0,0,0,0,0,0,0,0,0,0,0,0,0,0,0,0,0,0,0,0,0,0,0,0,0,0,0,0,0,{"$f":"1.05*ILG6^1.4*((2*$N$5)/($N$5*$G$5))*IF($B$5=100,ILG9,ILG12)+ILG13+ILG14","v":0},0,0,0,0,0,0,0,0,0,0,0,0,0,0,0,0,0,0,0,0,0,0,0,0,0,0,0,0,0,0,0,0,0,0,0,0,0,0,0,0,0,0,0,0,0,0,0,0,0,0,0,0,0,0,0,0,0,0,0,0,0,0,0,{"$f":"1.05*INS6^1.4*((2*$N$5)/($N$5*$G$5))*IF($B$5=100,INS9,INS12)+INS13+INS14","v":0},0,0,0,0,0,0,0,0,0,0,0,0,0,0,0,0,0,0,0,0,0,0,0,0,0,0,0,0,0,0,0,0,0,0,0,0,0,0,0,0,0,0,0,0,0,0,0,0,0,0,0,0,0,0,0,0,0,0,0,0,0,0,0,{"$f":"1.05*IQE6^1.4*((2*$N$5)/($N$5*$G$5))*IF($B$5=100,IQE9,IQE12)+IQE13+IQE14","v":0},0,0,0,0,0,0,0,0,0,0,0,0,0,0,0,0,0,0,0,0,0,0,0,0,0,0,0,0,0,0,0,0,0,0,0,0,0,0,0,0,0,0,0,0,0,0,0,0,0,0,0,0,0,0,0,0,0,0,0,0,0,0,0,{"$f":"1.05*ISQ6^1.4*((2*$N$5)/($N$5*$G$5))*IF($B$5=100,ISQ9,ISQ12)+ISQ13+ISQ14","v":0},0,0,0,0,0,0,0,0,0,0,0,0,0,0,0,0,0,0,0,0,0,0,0,0,0,0,0,0,0,0,0,0,0,0,0,0,0,0,0,0,0,0,0,0,0,0,0,0,0,0,0,0,0,0,0,0,0,0,0,0,0,0,0,{"$f":"1.05*IVC6^1.4*((2*$N$5)/($N$5*$G$5))*IF($B$5=100,IVC9,IVC12)+IVC13+IVC14","v":0},0,0,0,0,0,0,0,0,0,0,0,0,0,0,0,0,0,0,0,0,0,0,0,0,0,0,0,0,0,0,0,0,0,0,0,0,0,0,0,0,0,0,0,0,0,0,0,0,0,0,0,0,0,0,0,0,0,0,0,0,0,0,0,{"$f":"1.05*IXO6^1.4*((2*$N$5)/($N$5*$G$5))*IF($B$5=100,IXO9,IXO12)+IXO13+IXO14","v":0},0,0,0,0,0,0,0,0,0,0,0,0,0,0,0,0,0,0,0,0,0,0,0,0,0,0,0,0,0,0,0,0,0,0,0,0,0,0,0,0,0,0,0,0,0,0,0,0,0,0,0,0,0,0,0,0,0,0,0,0,0,0,0,{"$f":"1.05*JAA6^1.4*((2*$N$5)/($N$5*$G$5))*IF($B$5=100,JAA9,JAA12)+JAA13+JAA14","v":0},0,0,0,0,0,0,0,0,0,0,0,0,0,0,0,0,0,0,0,0,0,0,0,0,0,0,0,0,0,0,0,0,0,0,0,0,0,0,0,0,0,0,0,0,0,0,0,0,0,0,0,0,0,0,0,0,0,0,0,0,0,0,0,{"$f":"1.05*JCM6^1.4*((2*$N$5)/($N$5*$G$5))*IF($B$5=100,JCM9,JCM12)+JCM13+JCM14","v":0},0,0,0,0,0,0,0,0,0,0,0,0,0,0,0,0,0,0,0,0,0,0,0,0,0,0,0,0,0,0,0,0,0,0,0,0,0,0,0,0,0,0,0,0,0,0,0,0,0,0,0,0,0,0,0,0,0,0,0,0,0,0,0,{"$f":"1.05*JEY6^1.4*((2*$N$5)/($N$5*$G$5))*IF($B$5=100,JEY9,JEY12)+JEY13+JEY14","v":0},0,0,0,0,0,0,0,0,0,0,0,0,0,0,0,0,0,0,0,0,0,0,0,0,0,0,0,0,0,0,0,0,0,0,0,0,0,0,0,0,0,0,0,0,0,0,0,0,0,0,0,0,0,0,0,0,0,0,0,0,0,0,0,{"$f":"1.05*JHK6^1.4*((2*$N$5)/($N$5*$G$5))*IF($B$5=100,JHK9,JHK12)+JHK13+JHK14","v":0},0,0,0,0,0,0,0,0,0,0,0,0,0,0,0,0,0,0,0,0,0,0,0,0,0,0,0,0,0,0,0,0,0,0,0,0,0,0,0,0,0,0,0,0,0,0,0,0,0,0,0,0,0,0,0,0,0,0,0,0,0,0,0,{"$f":"1.05*JJW6^1.4*((2*$N$5)/($N$5*$G$5))*IF($B$5=100,JJW9,JJW12)+JJW13+JJW14","v":0},0,0,0,0,0,0,0,0,0,0,0,0,0,0,0,0,0,0,0,0,0,0,0,0,0,0,0,0,0,0,0,0,0,0,0,0,0,0,0,0,0,0,0,0,0,0,0,0,0,0,0,0,0,0,0,0,0,0,0,0,0,0,0,{"$f":"1.05*JMI6^1.4*((2*$N$5)/($N$5*$G$5))*IF($B$5=100,JMI9,JMI12)+JMI13+JMI14","v":0},0,0,0,0,0,0,0,0,0,0,0,0,0,0,0,0,0,0,0,0,0,0,0,0,0,0,0,0,0,0,0,0,0,0,0,0,0,0,0,0,0,0,0,0,0,0,0,0,0,0,0,0,0,0,0,0,0,0,0,0,0,0,0,{"$f":"1.05*JOU6^1.4*((2*$N$5)/($N$5*$G$5))*IF($B$5=100,JOU9,JOU12)+JOU13+JOU14","v":0},0,0,0,0,0,0,0,0,0,0,0,0,0,0,0,0,0,0,0,0,0,0,0,0,0,0,0,0,0,0,0,0,0,0,0,0,0,0,0,0,0,0,0,0,0,0,0,0,0,0,0,0,0,0,0,0,0,0,0,0,0,0,0,{"$f":"1.05*JRG6^1.4*((2*$N$5)/($N$5*$G$5))*IF($B$5=100,JRG9,JRG12)+JRG13+JRG14","v":0},0,0,0,0,0,0,0,0,0,0,0,0,0,0,0,0,0,0,0,0,0,0,0,0,0,0,0,0,0,0,0,0,0,0,0,0,0,0,0,0,0,0,0,0,0,0,0,0,0,0,0,0,0,0,0,0,0,0,0,0,0,0,0,{"$f":"1.05*JTS6^1.4*((2*$N$5)/($N$5*$G$5))*IF($B$5=100,JTS9,JTS12)+JTS13+JTS14","v":0},0,0,0,0,0,0,0,0,0,0,0,0,0,0,0,0,0,0,0,0,0,0,0,0,0,0,0,0,0,0,0,0,0,0,0,0,0,0,0,0,0,0,0,0,0,0,0,0,0,0,0,0,0,0,0,0,0,0,0,0,0,0,0,{"$f":"1.05*JWE6^1.4*((2*$N$5)/($N$5*$G$5))*IF($B$5=100,JWE9,JWE12)+JWE13+JWE14","v":0},0,0,0,0,0,0,0,0,0,0,0,0,0,0,0,0,0,0,0,0,0,0,0,0,0,0,0,0,0,0,0,0,0,0,0,0,0,0,0,0,0,0,0,0,0,0,0,0,0,0,0,0,0,0,0,0,0,0,0,0,0,0,0,{"$f":"1.05*JYQ6^1.4*((2*$N$5)/($N$5*$G$5))*IF($B$5=100,JYQ9,JYQ12)+JYQ13+JYQ14","v":0},0,0,0,0,0,0,0,0,0,0,0,0,0,0,0,0,0,0,0,0,0,0,0,0,0,0,0,0,0,0,0,0,0,0,0,0,0,0,0,0,0,0,0,0,0,0,0,0,0,0,0,0,0,0,0,0,0,0,0,0,0,0,0,{"$f":"1.05*KBC6^1.4*((2*$N$5)/($N$5*$G$5))*IF($B$5=100,KBC9,KBC12)+KBC13+KBC14","v":0},0,0,0,0,0,0,0,0,0,0,0,0,0,0,0,0,0,0,0,0,0,0,0,0,0,0,0,0,0,0,0,0,0,0,0,0,0,0,0,0,0,0,0,0,0,0,0,0,0,0,0,0,0,0,0,0,0,0,0,0,0,0,0,{"$f":"1.05*KDO6^1.4*((2*$N$5)/($N$5*$G$5))*IF($B$5=100,KDO9,KDO12)+KDO13+KDO14","v":0},0,0,0,0,0,0,0,0,0,0,0,0,0,0,0,0,0,0,0,0,0,0,0,0,0,0,0,0,0,0,0,0,0,0,0,0,0,0,0,0,0,0,0,0,0,0,0,0,0,0,0,0,0,0,0,0,0,0,0,0,0,0,0,{"$f":"1.05*KGA6^1.4*((2*$N$5)/($N$5*$G$5))*IF($B$5=100,KGA9,KGA12)+KGA13+KGA14","v":0},0,0,0,0,0,0,0,0,0,0,0,0,0,0,0,0,0,0,0,0,0,0,0,0,0,0,0,0,0,0,0,0,0,0,0,0,0,0,0,0,0,0,0,0,0,0,0,0,0,0,0,0,0,0,0,0,0,0,0,0,0,0,0,{"$f":"1.05*KIM6^1.4*((2*$N$5)/($N$5*$G$5))*IF($B$5=100,KIM9,KIM12)+KIM13+KIM14","v":0},0,0,0,0,0,0,0,0,0,0,0,0,0,0,0,0,0,0,0,0,0,0,0,0,0,0,0,0,0,0,0,0,0,0,0,0,0,0,0,0,0,0,0,0,0,0,0,0,0,0,0,0,0,0,0,0,0,0,0,0,0,0,0,{"$f":"1.05*KKY6^1.4*((2*$N$5)/($N$5*$G$5))*IF($B$5=100,KKY9,KKY12)+KKY13+KKY14","v":0},0,0,0,0,0,0,0,0,0,0,0,0,0,0,0,0,0,0,0,0,0,0,0,0,0,0,0,0,0,0,0,0,0,0,0,0,0,0,0,0,0,0,0,0,0,0,0,0,0,0,0,0,0,0,0,0,0,0,0,0,0,0,0,{"$f":"1.05*KNK6^1.4*((2*$N$5)/($N$5*$G$5))*IF($B$5=100,KNK9,KNK12)+KNK13+KNK14","v":0},0,0,0,0,0,0,0,0,0,0,0,0,0,0,0,0,0,0,0,0,0,0,0,0,0,0,0,0,0,0,0,0,0,0,0,0,0,0,0,0,0,0,0,0,0,0,0,0,0,0,0,0,0,0,0,0,0,0,0,0,0,0,0,{"$f":"1.05*KPW6^1.4*((2*$N$5)/($N$5*$G$5))*IF($B$5=100,KPW9,KPW12)+KPW13+KPW14","v":0},0,0,0,0,0,0,0,0,0,0,0,0,0,0,0,0,0,0,0,0,0,0,0,0,0,0,0,0,0,0,0,0,0,0,0,0,0,0,0,0,0,0,0,0,0,0,0,0,0,0,0,0,0,0,0,0,0,0,0,0,0,0,0,{"$f":"1.05*KSI6^1.4*((2*$N$5)/($N$5*$G$5))*IF($B$5=100,KSI9,KSI12)+KSI13+KSI14","v":0},0,0,0,0,0,0,0,0,0,0,0,0,0,0,0,0,0,0,0,0,0,0,0,0,0,0,0,0,0,0,0,0,0,0,0,0,0,0,0,0,0,0,0,0,0,0,0,0,0,0,0,0,0,0,0,0,0,0,0,0,0,0,0,{"$f":"1.05*KUU6^1.4*((2*$N$5)/($N$5*$G$5))*IF($B$5=100,KUU9,KUU12)+KUU13+KUU14","v":0},0,0,0,0,0,0,0,0,0,0,0,0,0,0,0,0,0,0,0,0,0,0,0,0,0,0,0,0,0,0,0,0,0,0,0,0,0,0,0,0,0,0,0,0,0,0,0,0,0,0,0,0,0,0,0,0,0,0,0,0,0,0,0,{"$f":"1.05*KXG6^1.4*((2*$N$5)/($N$5*$G$5))*IF($B$5=100,KXG9,KXG12)+KXG13+KXG14","v":0},0,0,0,0,0,0,0,0,0,0,0,0,0,0,0,0,0,0,0,0,0,0,0,0,0,0,0,0,0,0,0,0,0,0,0,0,0,0,0,0,0,0,0,0,0,0,0,0,0,0,0,0,0,0,0,0,0,0,0,0,0,0,0,{"$f":"1.05*KZS6^1.4*((2*$N$5)/($N$5*$G$5))*IF($B$5=100,KZS9,KZS12)+KZS13+KZS14","v":0},0,0,0,0,0,0,0,0,0,0,0,0,0,0,0,0,0,0,0,0,0,0,0,0,0,0,0,0,0,0,0,0,0,0,0,0,0,0,0,0,0,0,0,0,0,0,0,0,0,0,0,0,0,0,0,0,0,0,0,0,0,0,0,{"$f":"1.05*LCE6^1.4*((2*$N$5)/($N$5*$G$5))*IF($B$5=100,LCE9,LCE12)+LCE13+LCE14","v":0},0,0,0,0,0,0,0,0,0,0,0,0,0,0,0,0,0,0,0,0,0,0,0,0,0,0,0,0,0,0,0,0,0,0,0,0,0,0,0,0,0,0,0,0,0,0,0,0,0,0,0,0,0,0,0,0,0,0,0,0,0,0,0,{"$f":"1.05*LEQ6^1.4*((2*$N$5)/($N$5*$G$5))*IF($B$5=100,LEQ9,LEQ12)+LEQ13+LEQ14","v":0},0,0,0,0,0,0,0,0,0,0,0,0,0,0,0,0,0,0,0,0,0,0,0,0,0,0,0,0,0,0,0,0,0,0,0,0,0,0,0,0,0,0,0,0,0,0,0,0,0,0,0,0,0,0,0,0,0,0,0,0,0,0,0,{"$f":"1.05*LHC6^1.4*((2*$N$5)/($N$5*$G$5))*IF($B$5=100,LHC9,LHC12)+LHC13+LHC14","v":0},0,0,0,0,0,0,0,0,0,0,0,0,0,0,0,0,0,0,0,0,0,0,0,0,0,0,0,0,0,0,0,0,0,0,0,0,0,0,0,0,0,0,0,0,0,0,0,0,0,0,0,0,0,0,0,0,0,0,0,0,0,0,0,{"$f":"1.05*LJO6^1.4*((2*$N$5)/($N$5*$G$5))*IF($B$5=100,LJO9,LJO12)+LJO13+LJO14","v":0},0,0,0,0,0,0,0,0,0,0,0,0,0,0,0,0,0,0,0,0,0,0,0,0,0,0,0,0,0,0,0,0,0,0,0,0,0,0,0,0,0,0,0,0,0,0,0,0,0,0,0,0,0,0,0,0,0,0,0,0,0,0,0,{"$f":"1.05*LMA6^1.4*((2*$N$5)/($N$5*$G$5))*IF($B$5=100,LMA9,LMA12)+LMA13+LMA14","v":0},0,0,0,0,0,0,0,0,0,0,0,0,0,0,0,0,0,0,0,0,0,0,0,0,0,0,0,0,0,0,0,0,0,0,0,0,0,0,0,0,0,0,0,0,0,0,0,0,0,0,0,0,0,0,0,0,0,0,0,0,0,0,0,{"$f":"1.05*LOM6^1.4*((2*$N$5)/($N$5*$G$5))*IF($B$5=100,LOM9,LOM12)+LOM13+LOM14","v":0},0,0,0,0,0,0,0,0,0,0,0,0,0,0,0,0,0,0,0,0,0,0,0,0,0,0,0,0,0,0,0,0,0,0,0,0,0,0,0,0,0,0,0,0,0,0,0,0,0,0,0,0,0,0,0,0,0,0,0,0,0,0,0,{"$f":"1.05*LQY6^1.4*((2*$N$5)/($N$5*$G$5))*IF($B$5=100,LQY9,LQY12)+LQY13+LQY14","v":0},0,0,0,0,0,0,0,0,0,0,0,0,0,0,0,0,0,0,0,0,0,0,0,0,0,0,0,0,0,0,0,0,0,0,0,0,0,0,0,0,0,0,0,0,0,0,0,0,0,0,0,0,0,0,0,0,0,0,0,0,0,0,0,{"$f":"1.05*LTK6^1.4*((2*$N$5)/($N$5*$G$5))*IF($B$5=100,LTK9,LTK12)+LTK13+LTK14","v":0},0,0,0,0,0,0,0,0,0,0,0,0,0,0,0,0,0,0,0,0,0,0,0,0,0,0,0,0,0,0,0,0,0,0,0,0,0,0,0,0,0,0,0,0,0,0,0,0,0,0,0,0,0,0,0,0,0,0,0,0,0,0,0,{"$f":"1.05*LVW6^1.4*((2*$N$5)/($N$5*$G$5))*IF($B$5=100,LVW9,LVW12)+LVW13+LVW14","v":0},0,0,0,0,0,0,0,0,0,0,0,0,0,0,0,0,0,0,0,0,0,0,0,0,0,0,0,0,0,0,0,0,0,0,0,0,0,0,0,0,0,0,0,0,0,0,0,0,0,0,0,0,0,0,0,0,0,0,0,0,0,0,0,{"$f":"1.05*LYI6^1.4*((2*$N$5)/($N$5*$G$5))*IF($B$5=100,LYI9,LYI12)+LYI13+LYI14","v":0},0,0,0,0,0,0,0,0,0,0,0,0,0,0,0,0,0,0,0,0,0,0,0,0,0,0,0,0,0,0,0,0,0,0,0,0,0,0,0,0,0,0,0,0,0,0,0,0,0,0,0,0,0,0,0,0,0,0,0,0,0,0,0,{"$f":"1.05*MAU6^1.4*((2*$N$5)/($N$5*$G$5))*IF($B$5=100,MAU9,MAU12)+MAU13+MAU14","v":0},0,0,0,0,0,0,0,0,0,0,0,0,0,0,0,0,0,0,0,0,0,0,0,0,0,0,0,0,0,0,0,0,0,0,0,0,0,0,0,0,0,0,0,0,0,0,0,0,0,0,0,0,0,0,0,0,0,0,0,0,0,0,0,{"$f":"1.05*MDG6^1.4*((2*$N$5)/($N$5*$G$5))*IF($B$5=100,MDG9,MDG12)+MDG13+MDG14","v":0},0,0,0,0,0,0,0,0,0,0,0,0,0,0,0,0,0,0,0,0,0,0,0,0,0,0,0,0,0,0,0,0,0,0,0,0,0,0,0,0,0,0,0,0,0,0,0,0,0,0,0,0,0,0,0,0,0,0,0,0,0,0,0,{"$f":"1.05*MFS6^1.4*((2*$N$5)/($N$5*$G$5))*IF($B$5=100,MFS9,MFS12)+MFS13+MFS14","v":0},0,0,0,0,0,0,0,0,0,0,0,0,0,0,0,0,0,0,0,0,0,0,0,0,0,0,0,0,0,0,0,0,0,0,0,0,0,0,0,0,0,0,0,0,0,0,0,0,0,0,0,0,0,0,0,0,0,0,0,0,0,0,0,{"$f":"1.05*MIE6^1.4*((2*$N$5)/($N$5*$G$5))*IF($B$5=100,MIE9,MIE12)+MIE13+MIE14","v":0},0,0,0,0,0,0,0,0,0,0,0,0,0,0,0,0,0,0,0,0,0,0,0,0,0,0,0,0,0,0,0,0,0,0,0,0,0,0,0,0,0,0,0,0,0,0,0,0,0,0,0,0,0,0,0,0,0,0,0,0,0,0,0,{"$f":"1.05*MKQ6^1.4*((2*$N$5)/($N$5*$G$5))*IF($B$5=100,MKQ9,MKQ12)+MKQ13+MKQ14","v":0},0,0,0,0,0,0,0,0,0,0,0,0,0,0,0,0,0,0,0,0,0,0,0,0,0,0,0,0,0,0,0,0,0,0,0,0,0,0,0,0,0,0,0,0,0,0,0,0,0,0,0,0,0,0,0,0,0,0,0,0,0,0,0,{"$f":"1.05*MNC6^1.4*((2*$N$5)/($N$5*$G$5))*IF($B$5=100,MNC9,MNC12)+MNC13+MNC14","v":0},0,0,0,0,0,0,0,0,0,0,0,0,0,0,0,0,0,0,0,0,0,0,0,0,0,0,0,0,0,0,0,0,0,0,0,0,0,0,0,0,0,0,0,0,0,0,0,0,0,0,0,0,0,0,0,0,0,0,0,0,0,0,0,{"$f":"1.05*MPO6^1.4*((2*$N$5)/($N$5*$G$5))*IF($B$5=100,MPO9,MPO12)+MPO13+MPO14","v":0},0,0,0,0,0,0,0,0,0,0,0,0,0,0,0,0,0,0,0,0,0,0,0,0,0,0,0,0,0,0,0,0,0,0,0,0,0,0,0,0,0,0,0,0,0,0,0,0,0,0,0,0,0,0,0,0,0,0,0,0,0,0,0,{"$f":"1.05*MSA6^1.4*((2*$N$5)/($N$5*$G$5))*IF($B$5=100,MSA9,MSA12)+MSA13+MSA14","v":0},0,0,0,0,0,0,0,0,0,0,0,0,0,0,0,0,0,0,0,0,0,0,0,0,0,0,0,0,0,0,0,0,0,0,0,0,0,0,0,0,0,0,0,0,0,0,0,0,0,0,0,0,0,0,0,0,0,0,0,0,0,0,0,{"$f":"1.05*MUM6^1.4*((2*$N$5)/($N$5*$G$5))*IF($B$5=100,MUM9,MUM12)+MUM13+MUM14","v":0},0,0,0,0,0,0,0,0,0,0,0,0,0,0,0,0,0,0,0,0,0,0,0,0,0,0,0,0,0,0,0,0,0,0,0,0,0,0,0,0,0,0,0,0,0,0,0,0,0,0,0,0,0,0,0,0,0,0,0,0,0,0,0,{"$f":"1.05*MWY6^1.4*((2*$N$5)/($N$5*$G$5))*IF($B$5=100,MWY9,MWY12)+MWY13+MWY14","v":0},0,0,0,0,0,0,0,0,0,0,0,0,0,0,0,0,0,0,0,0,0,0,0,0,0,0,0,0,0,0,0,0,0,0,0,0,0,0,0,0,0,0,0,0,0,0,0,0,0,0,0,0,0,0,0,0,0,0,0,0,0,0,0,{"$f":"1.05*MZK6^1.4*((2*$N$5)/($N$5*$G$5))*IF($B$5=100,MZK9,MZK12)+MZK13+MZK14","v":0},0,0,0,0,0,0,0,0,0,0,0,0,0,0,0,0,0,0,0,0,0,0,0,0,0,0,0,0,0,0,0,0,0,0,0,0,0,0,0,0,0,0,0,0,0,0,0,0,0,0,0,0,0,0,0,0,0,0,0,0,0,0,0,{"$f":"1.05*NBW6^1.4*((2*$N$5)/($N$5*$G$5))*IF($B$5=100,NBW9,NBW12)+NBW13+NBW14","v":0},0,0,0,0,0,0,0,0,0,0,0,0,0,0,0,0,0,0,0,0,0,0,0,0,0,0,0,0,0,0,0,0,0,0,0,0,0,0,0,0,0,0,0,0,0,0,0,0,0,0,0,0,0,0,0,0,0,0,0,0,0,0,0,{"$f":"1.05*NEI6^1.4*((2*$N$5)/($N$5*$G$5))*IF($B$5=100,NEI9,NEI12)+NEI13+NEI14","v":0},0,0,0,0,0,0,0,0,0,0,0,0,0,0,0,0,0,0,0,0,0,0,0,0,0,0,0,0,0,0,0,0,0,0,0,0,0,0,0,0,0,0,0,0,0,0,0,0,0,0,0,0,0,0,0,0,0,0,0,0,0,0,0,{"$f":"1.05*NGU6^1.4*((2*$N$5)/($N$5*$G$5))*IF($B$5=100,NGU9,NGU12)+NGU13+NGU14","v":0},0,0,0,0,0,0,0,0,0,0,0,0,0,0,0,0,0,0,0,0,0,0,0,0,0,0,0,0,0,0,0,0,0,0,0,0,0,0,0,0,0,0,0,0,0,0,0,0,0,0,0,0,0,0,0,0,0,0,0,0,0,0,0,{"$f":"1.05*NJG6^1.4*((2*$N$5)/($N$5*$G$5))*IF($B$5=100,NJG9,NJG12)+NJG13+NJG14","v":0},0,0,0,0,0,0,0,0,0,0,0,0,0,0,0,0,0,0,0,0,0,0,0,0,0,0,0,0,0,0,0,0,0,0,0,0,0,0,0,0,0,0,0,0,0,0,0,0,0,0,0,0,0,0,0,0,0,0,0,0,0,0,0,{"$f":"1.05*NLS6^1.4*((2*$N$5)/($N$5*$G$5))*IF($B$5=100,NLS9,NLS12)+NLS13+NLS14","v":0},0,0,0,0,0,0,0,0,0,0,0,0,0,0,0,0,0,0,0,0,0,0,0,0,0,0,0,0,0,0,0,0,0,0,0,0,0,0,0,0,0,0,0,0,0,0,0,0,0,0,0,0,0,0,0,0,0,0,0,0,0,0,0,{"$f":"1.05*NOE6^1.4*((2*$N$5)/($N$5*$G$5))*IF($B$5=100,NOE9,NOE12)+NOE13+NOE14","v":0},0,0,0,0,0,0,0,0,0,0,0,0,0,0,0,0,0,0,0,0,0,0,0,0,0,0,0,0,0,0,0,0,0,0,0,0,0,0,0,0,0,0,0,0,0,0,0,0,0,0,0,0,0,0,0,0,0,0,0,0,0,0,0,{"$f":"1.05*NQQ6^1.4*((2*$N$5)/($N$5*$G$5))*IF($B$5=100,NQQ9,NQQ12)+NQQ13+NQQ14","v":0},0,0,0,0,0,0,0,0,0,0,0,0,0,0,0,0,0,0,0,0,0,0,0,0,0,0,0,0,0,0,0,0,0,0,0,0,0,0,0,0,0,0,0,0,0,0,0,0,0,0,0,0,0,0,0,0,0,0,0,0,0,0,0,{"$f":"1.05*NTC6^1.4*((2*$N$5)/($N$5*$G$5))*IF($B$5=100,NTC9,NTC12)+NTC13+NTC14","v":0},0,0,0,0,0,0,0,0,0,0,0,0,0,0,0,0,0,0,0,0,0,0,0,0,0,0,0,0,0,0,0,0,0,0,0,0,0,0,0,0,0,0,0,0,0,0,0,0,0,0,0,0,0,0,0,0,0,0,0,0,0,0,0,{"$f":"1.05*NVO6^1.4*((2*$N$5)/($N$5*$G$5))*IF($B$5=100,NVO9,NVO12)+NVO13+NVO14","v":0},0,0,0,0,0,0,0,0,0,0,0,0,0,0,0,0,0,0,0,0,0,0,0,0,0,0,0,0,0,0,0,0,0,0,0,0,0,0,0,0,0,0,0,0,0,0,0,0,0,0,0,0,0,0,0,0,0,0,0,0,0,0,0,{"$f":"1.05*NYA6^1.4*((2*$N$5)/($N$5*$G$5))*IF($B$5=100,NYA9,NYA12)+NYA13+NYA14","v":0},0,0,0,0,0,0,0,0,0,0,0,0,0,0,0,0,0,0,0,0,0,0,0,0,0,0,0,0,0,0,0,0,0,0,0,0,0,0,0,0,0,0,0,0,0,0,0,0,0,0,0,0,0,0,0,0,0,0,0,0,0,0,0,{"$f":"1.05*OAM6^1.4*((2*$N$5)/($N$5*$G$5))*IF($B$5=100,OAM9,OAM12)+OAM13+OAM14","v":0},0,0,0,0,0,0,0,0,0,0,0,0,0,0,0,0,0,0,0,0,0,0,0,0,0,0,0,0,0,0,0,0,0,0,0,0,0,0,0,0,0,0,0,0,0,0,0,0,0,0,0,0,0,0,0,0,0,0,0,0,0,0,0,{"$f":"1.05*OCY6^1.4*((2*$N$5)/($N$5*$G$5))*IF($B$5=100,OCY9,OCY12)+OCY13+OCY14","v":0},0,0,0,0,0,0,0,0,0,0,0,0,0,0,0,0,0,0,0,0,0,0,0,0,0,0,0,0,0,0,0,0,0,0,0,0,0,0,0,0,0,0,0,0,0,0,0,0,0,0,0,0,0,0,0,0,0,0,0,0,0,0,0,{"$f":"1.05*OFK6^1.4*((2*$N$5)/($N$5*$G$5))*IF($B$5=100,OFK9,OFK12)+OFK13+OFK14","v":0},0,0,0,0,0,0,0,0,0,0,0,0,0,0,0,0,0,0,0,0,0,0,0,0,0,0,0,0,0,0,0,0,0,0,0,0,0,0,0,0,0,0,0,0,0,0,0,0,0,0,0,0,0,0,0,0,0,0,0,0,0,0,0,{"$f":"1.05*OHW6^1.4*((2*$N$5)/($N$5*$G$5))*IF($B$5=100,OHW9,OHW12)+OHW13+OHW14","v":0},0,0,0,0,0,0,0,0,0,0,0,0,0,0,0,0,0,0,0,0,0,0,0,0,0,0,0,0,0,0,0,0,0,0,0,0,0,0,0,0,0,0,0,0,0,0,0,0,0,0,0,0,0,0,0,0,0,0,0,0,0,0,0,{"$f":"1.05*OKI6^1.4*((2*$N$5)/($N$5*$G$5))*IF($B$5=100,OKI9,OKI12)+OKI13+OKI14","v":0},0,0,0,0,0,0,0,0,0,0,0,0,0,0,0,0,0,0,0,0,0,0,0,0,0,0,0,0,0,0,0,0,0,0,0,0,0,0,0,0,0,0,0,0,0,0,0,0,0,0,0,0,0,0,0,0,0,0,0,0,0,0,0,{"$f":"1.05*OMU6^1.4*((2*$N$5)/($N$5*$G$5))*IF($B$5=100,OMU9,OMU12)+OMU13+OMU14","v":0},0,0,0,0,0,0,0,0,0,0,0,0,0,0,0,0,0,0,0,0,0,0,0,0,0,0,0,0,0,0,0,0,0,0,0,0,0,0,0,0,0,0,0,0,0,0,0,0,0,0,0,0,0,0,0,0,0,0,0,0,0,0,0,{"$f":"1.05*OPG6^1.4*((2*$N$5)/($N$5*$G$5))*IF($B$5=100,OPG9,OPG12)+OPG13+OPG14","v":0},0,0,0,0,0,0,0,0,0,0,0,0,0,0,0,0,0,0,0,0,0,0,0,0,0,0,0,0,0,0,0,0,0,0,0,0,0,0,0,0,0,0,0,0,0,0,0,0,0,0,0,0,0,0,0,0,0,0,0,0,0,0,0,{"$f":"1.05*ORS6^1.4*((2*$N$5)/($N$5*$G$5))*IF($B$5=100,ORS9,ORS12)+ORS13+ORS14","v":0},0,0,0,0,0,0,0,0,0,0,0,0,0,0,0,0,0,0,0,0,0,0,0,0,0,0,0,0,0,0,0,0,0,0,0,0,0,0,0,0,0,0,0,0,0,0,0,0,0,0,0,0,0,0,0,0,0,0,0,0,0,0,0,{"$f":"1.05*OUE6^1.4*((2*$N$5)/($N$5*$G$5))*IF($B$5=100,OUE9,OUE12)+OUE13+OUE14","v":0},0,0,0,0,0,0,0,0,0,0,0,0,0,0,0,0,0,0,0,0,0,0,0,0,0,0,0,0,0,0,0,0,0,0,0,0,0,0,0,0,0,0,0,0,0,0,0,0,0,0,0,0,0,0,0,0,0,0,0,0,0,0,0,{"$f":"1.05*OWQ6^1.4*((2*$N$5)/($N$5*$G$5))*IF($B$5=100,OWQ9,OWQ12)+OWQ13+OWQ14","v":0},0,0,0,0,0,0,0,0,0,0,0,0,0,0,0,0,0,0,0,0,0,0,0,0,0,0,0,0,0,0,0,0,0,0,0,0,0,0,0,0,0,0,0,0,0,0,0,0,0,0,0,0,0,0,0,0,0,0,0,0,0,0,0,{"$f":"1.05*OZC6^1.4*((2*$N$5)/($N$5*$G$5))*IF($B$5=100,OZC9,OZC12)+OZC13+OZC14","v":0},0,0,0,0,0,0,0,0,0,0,0,0,0,0,0,0,0,0,0,0,0,0,0,0,0,0,0,0,0,0,0,0,0,0,0,0,0,0,0,0,0,0,0,0,0,0,0,0,0,0,0,0,0,0,0,0,0,0,0,0,0,0,0,{"$f":"1.05*PBO6^1.4*((2*$N$5)/($N$5*$G$5))*IF($B$5=100,PBO9,PBO12)+PBO13+PBO14","v":0},0,0,0,0,0,0,0,0,0,0,0,0,0,0,0,0,0,0,0,0,0,0,0,0,0,0,0,0,0,0,0,0,0,0,0,0,0,0,0,0,0,0,0,0,0,0,0,0,0,0,0,0,0,0,0,0,0,0,0,0,0,0,0,{"$f":"1.05*PEA6^1.4*((2*$N$5)/($N$5*$G$5))*IF($B$5=100,PEA9,PEA12)+PEA13+PEA14","v":0},0,0,0,0,0,0,0,0,0,0,0,0,0,0,0,0,0,0,0,0,0,0,0,0,0,0,0,0,0,0,0,0,0,0,0,0,0,0,0,0,0,0,0,0,0,0,0,0,0,0,0,0,0,0,0,0,0,0,0,0,0,0,0,{"$f":"1.05*PGM6^1.4*((2*$N$5)/($N$5*$G$5))*IF($B$5=100,PGM9,PGM12)+PGM13+PGM14","v":0},0,0,0,0,0,0,0,0,0,0,0,0,0,0,0,0,0,0,0,0,0,0,0,0,0,0,0,0,0,0,0,0,0,0,0,0,0,0,0,0,0,0,0,0,0,0,0,0,0,0,0,0,0,0,0,0,0,0,0,0,0,0,0,{"$f":"1.05*PIY6^1.4*((2*$N$5)/($N$5*$G$5))*IF($B$5=100,PIY9,PIY12)+PIY13+PIY14","v":0},0,0,0,0,0,0,0,0,0,0,0,0,0,0,0,0,0,0,0,0,0,0,0,0,0,0,0,0,0,0,0,0,0,0,0,0,0,0,0,0,0,0,0,0,0,0,0,0,0,0,0,0,0,0,0,0,0,0,0,0,0,0,0,{"$f":"1.05*PLK6^1.4*((2*$N$5)/($N$5*$G$5))*IF($B$5=100,PLK9,PLK12)+PLK13+PLK14","v":0},0,0,0,0,0,0,0,0,0,0,0,0,0,0,0,0,0,0,0,0,0,0,0,0,0,0,0,0,0,0,0,0,0,0,0,0,0,0,0,0,0,0,0,0,0,0,0,0,0,0,0,0,0,0,0,0,0,0,0,0,0,0,0,{"$f":"1.05*PNW6^1.4*((2*$N$5)/($N$5*$G$5))*IF($B$5=100,PNW9,PNW12)+PNW13+PNW14","v":0},0,0,0,0,0,0,0,0,0,0,0,0,0,0,0,0,0,0,0,0,0,0,0,0,0,0,0,0,0,0,0,0,0,0,0,0,0,0,0,0,0,0,0,0,0,0,0,0,0,0,0,0,0,0,0,0,0,0,0,0,0,0,0,{"$f":"1.05*PQI6^1.4*((2*$N$5)/($N$5*$G$5))*IF($B$5=100,PQI9,PQI12)+PQI13+PQI14","v":0},0,0,0,0,0,0,0,0,0,0,0,0,0,0,0,0,0,0,0,0,0,0,0,0,0,0,0,0,0,0,0,0,0,0,0,0,0,0,0,0,0,0,0,0,0,0,0,0,0,0,0,0,0,0,0,0,0,0,0,0,0,0,0,{"$f":"1.05*PSU6^1.4*((2*$N$5)/($N$5*$G$5))*IF($B$5=100,PSU9,PSU12)+PSU13+PSU14","v":0},0,0,0,0,0,0,0,0,0,0,0,0,0,0,0,0,0,0,0,0,0,0,0,0,0,0,0,0,0,0,0,0,0,0,0,0,0,0,0,0,0,0,0,0,0,0,0,0,0,0,0,0,0,0,0,0,0,0,0,0,0,0,0,{"$f":"1.05*PVG6^1.4*((2*$N$5)/($N$5*$G$5))*IF($B$5=100,PVG9,PVG12)+PVG13+PVG14","v":0},0,0,0,0,0,0,0,0,0,0,0,0,0,0,0,0,0,0,0,0,0,0,0,0,0,0,0,0,0,0,0,0,0,0,0,0,0,0,0,0,0,0,0,0,0,0,0,0,0,0,0,0,0,0,0,0,0,0,0,0,0,0,0,{"$f":"1.05*PXS6^1.4*((2*$N$5)/($N$5*$G$5))*IF($B$5=100,PXS9,PXS12)+PXS13+PXS14","v":0},0,0,0,0,0,0,0,0,0,0,0,0,0,0,0,0,0,0,0,0,0,0,0,0,0,0,0,0,0,0,0,0,0,0,0,0,0,0,0,0,0,0,0,0,0,0,0,0,0,0,0,0,0,0,0,0,0,0,0,0,0,0,0,{"$f":"1.05*QAE6^1.4*((2*$N$5)/($N$5*$G$5))*IF($B$5=100,QAE9,QAE12)+QAE13+QAE14","v":0},0,0,0,0,0,0,0,0,0,0,0,0,0,0,0,0,0,0,0,0,0,0,0,0,0,0,0,0,0,0,0,0,0,0,0,0,0,0,0,0,0,0,0,0,0,0,0,0,0,0,0,0,0,0,0,0,0,0,0,0,0,0,0,{"$f":"1.05*QCQ6^1.4*((2*$N$5)/($N$5*$G$5))*IF($B$5=100,QCQ9,QCQ12)+QCQ13+QCQ14","v":0},0,0,0,0,0,0,0,0,0,0,0,0,0,0,0,0,0,0,0,0,0,0,0,0,0,0,0,0,0,0,0,0,0,0,0,0,0,0,0,0,0,0,0,0,0,0,0,0,0,0,0,0,0,0,0,0,0,0,0,0,0,0,0,{"$f":"1.05*QFC6^1.4*((2*$N$5)/($N$5*$G$5))*IF($B$5=100,QFC9,QFC12)+QFC13+QFC14","v":0},0,0,0,0,0,0,0,0,0,0,0,0,0,0,0,0,0,0,0,0,0,0,0,0,0,0,0,0,0,0,0,0,0,0,0,0,0,0,0,0,0,0,0,0,0,0,0,0,0,0,0,0,0,0,0,0,0,0,0,0,0,0,0,{"$f":"1.05*QHO6^1.4*((2*$N$5)/($N$5*$G$5))*IF($B$5=100,QHO9,QHO12)+QHO13+QHO14","v":0},0,0,0,0,0,0,0,0,0,0,0,0,0,0,0,0,0,0,0,0,0,0,0,0,0,0,0,0,0,0,0,0,0,0,0,0,0,0,0,0,0,0,0,0,0,0,0,0,0,0,0,0,0,0,0,0,0,0,0,0,0,0,0,{"$f":"1.05*QKA6^1.4*((2*$N$5)/($N$5*$G$5))*IF($B$5=100,QKA9,QKA12)+QKA13+QKA14","v":0},0,0,0,0,0,0,0,0,0,0,0,0,0,0,0,0,0,0,0,0,0,0,0,0,0,0,0,0,0,0,0,0,0,0,0,0,0,0,0,0,0,0,0,0,0,0,0,0,0,0,0,0,0,0,0,0,0,0,0,0,0,0,0,{"$f":"1.05*QMM6^1.4*((2*$N$5)/($N$5*$G$5))*IF($B$5=100,QMM9,QMM12)+QMM13+QMM14","v":0},0,0,0,0,0,0,0,0,0,0,0,0,0,0,0,0,0,0,0,0,0,0,0,0,0,0,0,0,0,0,0,0,0,0,0,0,0,0,0,0,0,0,0,0,0,0,0,0,0,0,0,0,0,0,0,0,0,0,0,0,0,0,0,{"$f":"1.05*QOY6^1.4*((2*$N$5)/($N$5*$G$5))*IF($B$5=100,QOY9,QOY12)+QOY13+QOY14","v":0},0,0,0,0,0,0,0,0,0,0,0,0,0,0,0,0,0,0,0,0,0,0,0,0,0,0,0,0,0,0,0,0,0,0,0,0,0,0,0,0,0,0,0,0,0,0,0,0,0,0,0,0,0,0,0,0,0,0,0,0,0,0,0,{"$f":"1.05*QRK6^1.4*((2*$N$5)/($N$5*$G$5))*IF($B$5=100,QRK9,QRK12)+QRK13+QRK14","v":0},0,0,0,0,0,0,0,0,0,0,0,0,0,0,0,0,0,0,0,0,0,0,0,0,0,0,0,0,0,0,0,0,0,0,0,0,0,0,0,0,0,0,0,0,0,0,0,0,0,0,0,0,0,0,0,0,0,0,0,0,0,0,0,{"$f":"1.05*QTW6^1.4*((2*$N$5)/($N$5*$G$5))*IF($B$5=100,QTW9,QTW12)+QTW13+QTW14","v":0},0,0,0,0,0,0,0,0,0,0,0,0,0,0,0,0,0,0,0,0,0,0,0,0,0,0,0,0,0,0,0,0,0,0,0,0,0,0,0,0,0,0,0,0,0,0,0,0,0,0,0,0,0,0,0,0,0,0,0,0,0,0,0,{"$f":"1.05*QWI6^1.4*((2*$N$5)/($N$5*$G$5))*IF($B$5=100,QWI9,QWI12)+QWI13+QWI14","v":0},0,0,0,0,0,0,0,0,0,0,0,0,0,0,0,0,0,0,0,0,0,0,0,0,0,0,0,0,0,0,0,0,0,0,0,0,0,0,0,0,0,0,0,0,0,0,0,0,0,0,0,0,0,0,0,0,0,0,0,0,0,0,0,{"$f":"1.05*QYU6^1.4*((2*$N$5)/($N$5*$G$5))*IF($B$5=100,QYU9,QYU12)+QYU13+QYU14","v":0},0,0,0,0,0,0,0,0,0,0,0,0,0,0,0,0,0,0,0,0,0,0,0,0,0,0,0,0,0,0,0,0,0,0,0,0,0,0,0,0,0,0,0,0,0,0,0,0,0,0,0,0,0,0,0,0,0,0,0,0,0,0,0,{"$f":"1.05*RBG6^1.4*((2*$N$5)/($N$5*$G$5))*IF($B$5=100,RBG9,RBG12)+RBG13+RBG14","v":0},0,0,0,0,0,0,0,0,0,0,0,0,0,0,0,0,0,0,0,0,0,0,0,0,0,0,0,0,0,0,0,0,0,0,0,0,0,0,0,0,0,0,0,0,0,0,0,0,0,0,0,0,0,0,0,0,0,0,0,0,0,0,0,{"$f":"1.05*RDS6^1.4*((2*$N$5)/($N$5*$G$5))*IF($B$5=100,RDS9,RDS12)+RDS13+RDS14","v":0},0,0,0,0,0,0,0,0,0,0,0,0,0,0,0,0,0,0,0,0,0,0,0,0,0,0,0,0,0,0,0,0,0,0,0,0,0,0,0,0,0,0,0,0,0,0,0,0,0,0,0,0,0,0,0,0,0,0,0,0,0,0,0,{"$f":"1.05*RGE6^1.4*((2*$N$5)/($N$5*$G$5))*IF($B$5=100,RGE9,RGE12)+RGE13+RGE14","v":0},0,0,0,0,0,0,0,0,0,0,0,0,0,0,0,0,0,0,0,0,0,0,0,0,0,0,0,0,0,0,0,0,0,0,0,0,0,0,0,0,0,0,0,0,0,0,0,0,0,0,0,0,0,0,0,0,0,0,0,0,0,0,0,{"$f":"1.05*RIQ6^1.4*((2*$N$5)/($N$5*$G$5))*IF($B$5=100,RIQ9,RIQ12)+RIQ13+RIQ14","v":0},0,0,0,0,0,0,0,0,0,0,0,0,0,0,0,0,0,0,0,0,0,0,0,0,0,0,0,0,0,0,0,0,0,0,0,0,0,0,0,0,0,0,0,0,0,0,0,0,0,0,0,0,0,0,0,0,0,0,0,0,0,0,0,{"$f":"1.05*RLC6^1.4*((2*$N$5)/($N$5*$G$5))*IF($B$5=100,RLC9,RLC12)+RLC13+RLC14","v":0},0,0,0,0,0,0,0,0,0,0,0,0,0,0,0,0,0,0,0,0,0,0,0,0,0,0,0,0,0,0,0,0,0,0,0,0,0,0,0,0,0,0,0,0,0,0,0,0,0,0,0,0,0,0,0,0,0,0,0,0,0,0,0,{"$f":"1.05*RNO6^1.4*((2*$N$5)/($N$5*$G$5))*IF($B$5=100,RNO9,RNO12)+RNO13+RNO14","v":0},0,0,0,0,0,0,0,0,0,0,0,0,0,0,0,0,0,0,0,0,0,0,0,0,0,0,0,0,0,0,0,0,0,0,0,0,0,0,0,0,0,0,0,0,0,0,0,0,0,0,0,0,0,0,0,0,0,0,0,0,0,0,0,{"$f":"1.05*RQA6^1.4*((2*$N$5)/($N$5*$G$5))*IF($B$5=100,RQA9,RQA12)+RQA13+RQA14","v":0},0,0,0,0,0,0,0,0,0,0,0,0,0,0,0,0,0,0,0,0,0,0,0,0,0,0,0,0,0,0,0,0,0,0,0,0,0,0,0,0,0,0,0,0,0,0,0,0,0,0,0,0,0,0,0,0,0,0,0,0,0,0,0,{"$f":"1.05*RSM6^1.4*((2*$N$5)/($N$5*$G$5))*IF($B$5=100,RSM9,RSM12)+RSM13+RSM14","v":0},0,0,0,0,0,0,0,0,0,0,0,0,0,0,0,0,0,0,0,0,0,0,0,0,0,0,0,0,0,0,0,0,0,0,0,0,0,0,0,0,0,0,0,0,0,0,0,0,0,0,0,0,0,0,0,0,0,0,0,0,0,0,0,{"$f":"1.05*RUY6^1.4*((2*$N$5)/($N$5*$G$5))*IF($B$5=100,RUY9,RUY12)+RUY13+RUY14","v":0},0,0,0,0,0,0,0,0,0,0,0,0,0,0,0,0,0,0,0,0,0,0,0,0,0,0,0,0,0,0,0,0,0,0,0,0,0,0,0,0,0,0,0,0,0,0,0,0,0,0,0,0,0,0,0,0,0,0,0,0,0,0,0,{"$f":"1.05*RXK6^1.4*((2*$N$5)/($N$5*$G$5))*IF($B$5=100,RXK9,RXK12)+RXK13+RXK14","v":0},0,0,0,0,0,0,0,0,0,0,0,0,0,0,0,0,0,0,0,0,0,0,0,0,0,0,0,0,0,0,0,0,0,0,0,0,0,0,0,0,0,0,0,0,0,0,0,0,0,0,0,0,0,0,0,0,0,0,0,0,0,0,0,{"$f":"1.05*RZW6^1.4*((2*$N$5)/($N$5*$G$5))*IF($B$5=100,RZW9,RZW12)+RZW13+RZW14","v":0},0,0,0,0,0,0,0,0,0,0,0,0,0,0,0,0,0,0,0,0,0,0,0,0,0,0,0,0,0,0,0,0,0,0,0,0,0,0,0,0,0,0,0,0,0,0,0,0,0,0,0,0,0,0,0,0,0,0,0,0,0,0,0,{"$f":"1.05*SCI6^1.4*((2*$N$5)/($N$5*$G$5))*IF($B$5=100,SCI9,SCI12)+SCI13+SCI14","v":0},0,0,0,0,0,0,0,0,0,0,0,0,0,0,0,0,0,0,0,0,0,0,0,0,0,0,0,0,0,0,0,0,0,0,0,0,0,0,0,0,0,0,0,0,0,0,0,0,0,0,0,0,0,0,0,0,0,0,0,0,0,0,0,{"$f":"1.05*SEU6^1.4*((2*$N$5)/($N$5*$G$5))*IF($B$5=100,SEU9,SEU12)+SEU13+SEU14","v":0},0,0,0,0,0,0,0,0,0,0,0,0,0,0,0,0,0,0,0,0,0,0,0,0,0,0,0,0,0,0,0,0,0,0,0,0,0,0,0,0,0,0,0,0,0,0,0,0,0,0,0,0,0,0,0,0,0,0,0,0,0,0,0,{"$f":"1.05*SHG6^1.4*((2*$N$5)/($N$5*$G$5))*IF($B$5=100,SHG9,SHG12)+SHG13+SHG14","v":0},0,0,0,0,0,0,0,0,0,0,0,0,0,0,0,0,0,0,0,0,0,0,0,0,0,0,0,0,0,0,0,0,0,0,0,0,0,0,0,0,0,0,0,0,0,0,0,0,0,0,0,0,0,0,0,0,0,0,0,0,0,0,0,{"$f":"1.05*SJS6^1.4*((2*$N$5)/($N$5*$G$5))*IF($B$5=100,SJS9,SJS12)+SJS13+SJS14","v":0},0,0,0,0,0,0,0,0,0,0,0,0,0,0,0,0,0,0,0,0,0,0,0,0,0,0,0,0,0,0,0,0,0,0,0,0,0,0,0,0,0,0,0,0,0,0,0,0,0,0,0,0,0,0,0,0,0,0,0,0,0,0,0,{"$f":"1.05*SME6^1.4*((2*$N$5)/($N$5*$G$5))*IF($B$5=100,SME9,SME12)+SME13+SME14","v":0},0,0,0,0,0,0,0,0,0,0,0,0,0,0,0,0,0,0,0,0,0,0,0,0,0,0,0,0,0,0,0,0,0,0,0,0,0,0,0,0,0,0,0,0,0,0,0,0,0,0,0,0,0,0,0,0,0,0,0,0,0,0,0,{"$f":"1.05*SOQ6^1.4*((2*$N$5)/($N$5*$G$5))*IF($B$5=100,SOQ9,SOQ12)+SOQ13+SOQ14","v":0},0,0,0,0,0,0,0,0,0,0,0,0,0,0,0,0,0,0,0,0,0,0,0,0,0,0,0,0,0,0,0,0,0,0,0,0,0,0,0,0,0,0,0,0,0,0,0,0,0,0,0,0,0,0,0,0,0,0,0,0,0,0,0,{"$f":"1.05*SRC6^1.4*((2*$N$5)/($N$5*$G$5))*IF($B$5=100,SRC9,SRC12)+SRC13+SRC14","v":0},0,0,0,0,0,0,0,0,0,0,0,0,0,0,0,0,0,0,0,0,0,0,0,0,0,0,0,0,0,0,0,0,0,0,0,0,0,0,0,0,0,0,0,0,0,0,0,0,0,0,0,0,0,0,0,0,0,0,0,0,0,0,0,{"$f":"1.05*STO6^1.4*((2*$N$5)/($N$5*$G$5))*IF($B$5=100,STO9,STO12)+STO13+STO14","v":0},0,0,0,0,0,0,0,0,0,0,0,0,0,0,0,0,0,0,0,0,0,0,0,0,0,0,0,0,0,0,0,0,0,0,0,0,0,0,0,0,0,0,0,0,0,0,0,0,0,0,0,0,0,0,0,0,0,0,0,0,0,0,0,{"$f":"1.05*SWA6^1.4*((2*$N$5)/($N$5*$G$5))*IF($B$5=100,SWA9,SWA12)+SWA13+SWA14","v":0},0,0,0,0,0,0,0,0,0,0,0,0,0,0,0,0,0,0,0,0,0,0,0,0,0,0,0,0,0,0,0,0,0,0,0,0,0,0,0,0,0,0,0,0,0,0,0,0,0,0,0,0,0,0,0,0,0,0,0,0,0,0,0,{"$f":"1.05*SYM6^1.4*((2*$N$5)/($N$5*$G$5))*IF($B$5=100,SYM9,SYM12)+SYM13+SYM14","v":0},0,0,0,0,0,0,0,0,0,0,0,0,0,0,0,0,0,0,0,0,0,0,0,0,0,0,0,0,0,0,0,0,0,0,0,0,0,0,0,0,0,0,0,0,0,0,0,0,0,0,0,0,0,0,0,0,0,0,0,0,0,0,0,{"$f":"1.05*TAY6^1.4*((2*$N$5)/($N$5*$G$5))*IF($B$5=100,TAY9,TAY12)+TAY13+TAY14","v":0},0,0,0,0,0,0,0,0,0,0,0,0,0,0,0,0,0,0,0,0,0,0,0,0,0,0,0,0,0,0,0,0,0,0,0,0,0,0,0,0,0,0,0,0,0,0,0,0,0,0,0,0,0,0,0,0,0,0,0,0,0,0,0,{"$f":"1.05*TDK6^1.4*((2*$N$5)/($N$5*$G$5))*IF($B$5=100,TDK9,TDK12)+TDK13+TDK14","v":0},0,0,0,0,0,0,0,0,0,0,0,0,0,0,0,0,0,0,0,0,0,0,0,0,0,0,0,0,0,0,0,0,0,0,0,0,0,0,0,0,0,0,0,0,0,0,0,0,0,0,0,0,0,0,0,0,0,0,0,0,0,0,0,{"$f":"1.05*TFW6^1.4*((2*$N$5)/($N$5*$G$5))*IF($B$5=100,TFW9,TFW12)+TFW13+TFW14","v":0},0,0,0,0,0,0,0,0,0,0,0,0,0,0,0,0,0,0,0,0,0,0,0,0,0,0,0,0,0,0,0,0,0,0,0,0,0,0,0,0,0,0,0,0,0,0,0,0,0,0,0,0,0,0,0,0,0,0,0,0,0,0,0,{"$f":"1.05*TII6^1.4*((2*$N$5)/($N$5*$G$5))*IF($B$5=100,TII9,TII12)+TII13+TII14","v":0},0,0,0,0,0,0,0,0,0,0,0,0,0,0,0,0,0,0,0,0,0,0,0,0,0,0,0,0,0,0,0,0,0,0,0,0,0,0,0,0,0,0,0,0,0,0,0,0,0,0,0,0,0,0,0,0,0,0,0,0,0,0,0,{"$f":"1.05*TKU6^1.4*((2*$N$5)/($N$5*$G$5))*IF($B$5=100,TKU9,TKU12)+TKU13+TKU14","v":0},0,0,0,0,0,0,0,0,0,0,0,0,0,0,0,0,0,0,0,0,0,0,0,0,0,0,0,0,0,0,0,0,0,0,0,0,0,0,0,0,0,0,0,0,0,0,0,0,0,0,0,0,0,0,0,0,0,0,0,0,0,0,0,{"$f":"1.05*TNG6^1.4*((2*$N$5)/($N$5*$G$5))*IF($B$5=100,TNG9,TNG12)+TNG13+TNG14","v":0},0,0,0,0,0,0,0,0,0,0,0,0,0,0,0,0,0,0,0,0,0,0,0,0,0,0,0,0,0,0,0,0,0,0,0,0,0,0,0,0,0,0,0,0,0,0,0,0,0,0,0,0,0,0,0,0,0,0,0,0,0,0,0,{"$f":"1.05*TPS6^1.4*((2*$N$5)/($N$5*$G$5))*IF($B$5=100,TPS9,TPS12)+TPS13+TPS14","v":0},0,0,0,0,0,0,0,0,0,0,0,0,0,0,0,0,0,0,0,0,0,0,0,0,0,0,0,0,0,0,0,0,0,0,0,0,0,0,0,0,0,0,0,0,0,0,0,0,0,0,0,0,0,0,0,0,0,0,0,0,0,0,0,{"$f":"1.05*TSE6^1.4*((2*$N$5)/($N$5*$G$5))*IF($B$5=100,TSE9,TSE12)+TSE13+TSE14","v":0},0,0,0,0,0,0,0,0,0,0,0,0,0,0,0,0,0,0,0,0,0,0,0,0,0,0,0,0,0,0,0,0,0,0,0,0,0,0,0,0,0,0,0,0,0,0,0,0,0,0,0,0,0,0,0,0,0,0,0,0,0,0,0,{"$f":"1.05*TUQ6^1.4*((2*$N$5)/($N$5*$G$5))*IF($B$5=100,TUQ9,TUQ12)+TUQ13+TUQ14","v":0},0,0,0,0,0,0,0,0,0,0,0,0,0,0,0,0,0,0,0,0,0,0,0,0,0,0,0,0,0,0,0,0,0,0,0,0,0,0,0,0,0,0,0,0,0,0,0,0,0,0,0,0,0,0,0,0,0,0,0,0,0,0,0,{"$f":"1.05*TXC6^1.4*((2*$N$5)/($N$5*$G$5))*IF($B$5=100,TXC9,TXC12)+TXC13+TXC14","v":0},0,0,0,0,0,0,0,0,0,0,0,0,0,0,0,0,0,0,0,0,0,0,0,0,0,0,0,0,0,0,0,0,0,0,0,0,0,0,0,0,0,0,0,0,0,0,0,0,0,0,0,0,0,0,0,0,0,0,0,0,0,0,0,{"$f":"1.05*TZO6^1.4*((2*$N$5)/($N$5*$G$5))*IF($B$5=100,TZO9,TZO12)+TZO13+TZO14","v":0},0,0,0,0,0,0,0,0,0,0,0,0,0,0,0,0,0,0,0,0,0,0,0,0,0,0,0,0,0,0,0,0,0,0,0,0,0,0,0,0,0,0,0,0,0,0,0,0,0,0,0,0,0,0,0,0,0,0,0,0,0,0,0,{"$f":"1.05*UCA6^1.4*((2*$N$5)/($N$5*$G$5))*IF($B$5=100,UCA9,UCA12)+UCA13+UCA14","v":0},0,0,0,0,0,0,0,0,0,0,0,0,0,0,0,0,0,0,0,0,0,0,0,0,0,0,0,0,0,0,0,0,0,0,0,0,0,0,0,0,0,0,0,0,0,0,0,0,0,0,0,0,0,0,0,0,0,0,0,0,0,0,0,{"$f":"1.05*UEM6^1.4*((2*$N$5)/($N$5*$G$5))*IF($B$5=100,UEM9,UEM12)+UEM13+UEM14","v":0},0,0,0,0,0,0,0,0,0,0,0,0,0,0,0,0,0,0,0,0,0,0,0,0,0,0,0,0,0,0,0,0,0,0,0,0,0,0,0,0,0,0,0,0,0,0,0,0,0,0,0,0,0,0,0,0,0,0,0,0,0,0,0,{"$f":"1.05*UGY6^1.4*((2*$N$5)/($N$5*$G$5))*IF($B$5=100,UGY9,UGY12)+UGY13+UGY14","v":0},0,0,0,0,0,0,0,0,0,0,0,0,0,0,0,0,0,0,0,0,0,0,0,0,0,0,0,0,0,0,0,0,0,0,0,0,0,0,0,0,0,0,0,0,0,0,0,0,0,0,0,0,0,0,0,0,0,0,0,0,0,0,0,{"$f":"1.05*UJK6^1.4*((2*$N$5)/($N$5*$G$5))*IF($B$5=100,UJK9,UJK12)+UJK13+UJK14","v":0},0,0,0,0,0,0,0,0,0,0,0,0,0,0,0,0,0,0,0,0,0,0,0,0,0,0,0,0,0,0,0,0,0,0,0,0,0,0,0,0,0,0,0,0,0,0,0,0,0,0,0,0,0,0,0,0,0,0,0,0,0,0,0,{"$f":"1.05*ULW6^1.4*((2*$N$5)/($N$5*$G$5))*IF($B$5=100,ULW9,ULW12)+ULW13+ULW14","v":0},0,0,0,0,0,0,0,0,0,0,0,0,0,0,0,0,0,0,0,0,0,0,0,0,0,0,0,0,0,0,0,0,0,0,0,0,0,0,0,0,0,0,0,0,0,0,0,0,0,0,0,0,0,0,0,0,0,0,0,0,0,0,0,{"$f":"1.05*UOI6^1.4*((2*$N$5)/($N$5*$G$5))*IF($B$5=100,UOI9,UOI12)+UOI13+UOI14","v":0},0,0,0,0,0,0,0,0,0,0,0,0,0,0,0,0,0,0,0,0,0,0,0,0,0,0,0,0,0,0,0,0,0,0,0,0,0,0,0,0,0,0,0,0,0,0,0,0,0,0,0,0,0,0,0,0,0,0,0,0,0,0,0,{"$f":"1.05*UQU6^1.4*((2*$N$5)/($N$5*$G$5))*IF($B$5=100,UQU9,UQU12)+UQU13+UQU14","v":0},0,0,0,0,0,0,0,0,0,0,0,0,0,0,0,0,0,0,0,0,0,0,0,0,0,0,0,0,0,0,0,0,0,0,0,0,0,0,0,0,0,0,0,0,0,0,0,0,0,0,0,0,0,0,0,0,0,0,0,0,0,0,0,{"$f":"1.05*UTG6^1.4*((2*$N$5)/($N$5*$G$5))*IF($B$5=100,UTG9,UTG12)+UTG13+UTG14","v":0},0,0,0,0,0,0,0,0,0,0,0,0,0,0,0,0,0,0,0,0,0,0,0,0,0,0,0,0,0,0,0,0,0,0,0,0,0,0,0,0,0,0,0,0,0,0,0,0,0,0,0,0,0,0,0,0,0,0,0,0,0,0,0,{"$f":"1.05*UVS6^1.4*((2*$N$5)/($N$5*$G$5))*IF($B$5=100,UVS9,UVS12)+UVS13+UVS14","v":0},0,0,0,0,0,0,0,0,0,0,0,0,0,0,0,0,0,0,0,0,0,0,0,0,0,0,0,0,0,0,0,0,0,0,0,0,0,0,0,0,0,0,0,0,0,0,0,0,0,0,0,0,0,0,0,0,0,0,0,0,0,0,0,{"$f":"1.05*UYE6^1.4*((2*$N$5)/($N$5*$G$5))*IF($B$5=100,UYE9,UYE12)+UYE13+UYE14","v":0},0,0,0,0,0,0,0,0,0,0,0,0,0,0,0,0,0,0,0,0,0,0,0,0,0,0,0,0,0,0,0,0,0,0,0,0,0,0,0,0,0,0,0,0,0,0,0,0,0,0,0,0,0,0,0,0,0,0,0,0,0,0,0,{"$f":"1.05*VAQ6^1.4*((2*$N$5)/($N$5*$G$5))*IF($B$5=100,VAQ9,VAQ12)+VAQ13+VAQ14","v":0},0,0,0,0,0,0,0,0,0,0,0,0,0,0,0,0,0,0,0,0,0,0,0,0,0,0,0,0,0,0,0,0,0,0,0,0,0,0,0,0,0,0,0,0,0,0,0,0,0,0,0,0,0,0,0,0,0,0,0,0,0,0,0,{"$f":"1.05*VDC6^1.4*((2*$N$5)/($N$5*$G$5))*IF($B$5=100,VDC9,VDC12)+VDC13+VDC14","v":0},0,0,0,0,0,0,0,0,0,0,0,0,0,0,0,0,0,0,0,0,0,0,0,0,0,0,0,0,0,0,0,0,0,0,0,0,0,0,0,0,0,0,0,0,0,0,0,0,0,0,0,0,0,0,0,0,0,0,0,0,0,0,0,{"$f":"1.05*VFO6^1.4*((2*$N$5)/($N$5*$G$5))*IF($B$5=100,VFO9,VFO12)+VFO13+VFO14","v":0},0,0,0,0,0,0,0,0,0,0,0,0,0,0,0,0,0,0,0,0,0,0,0,0,0,0,0,0,0,0,0,0,0,0,0,0,0,0,0,0,0,0,0,0,0,0,0,0,0,0,0,0,0,0,0,0,0,0,0,0,0,0,0,{"$f":"1.05*VIA6^1.4*((2*$N$5)/($N$5*$G$5))*IF($B$5=100,VIA9,VIA12)+VIA13+VIA14","v":0},0,0,0,0,0,0,0,0,0,0,0,0,0,0,0,0,0,0,0,0,0,0,0,0,0,0,0,0,0,0,0,0,0,0,0,0,0,0,0,0,0,0,0,0,0,0,0,0,0,0,0,0,0,0,0,0,0,0,0,0,0,0,0,{"$f":"1.05*VKM6^1.4*((2*$N$5)/($N$5*$G$5))*IF($B$5=100,VKM9,VKM12)+VKM13+VKM14","v":0},0,0,0,0,0,0,0,0,0,0,0,0,0,0,0,0,0,0,0,0,0,0,0,0,0,0,0,0,0,0,0,0,0,0,0,0,0,0,0,0,0,0,0,0,0,0,0,0,0,0,0,0,0,0,0,0,0,0,0,0,0,0,0,{"$f":"1.05*VMY6^1.4*((2*$N$5)/($N$5*$G$5))*IF($B$5=100,VMY9,VMY12)+VMY13+VMY14","v":0},0,0,0,0,0,0,0,0,0,0,0,0,0,0,0,0,0,0,0,0,0,0,0,0,0,0,0,0,0,0,0,0,0,0,0,0,0,0,0,0,0,0,0,0,0,0,0,0,0,0,0,0,0,0,0,0,0,0,0,0,0,0,0,{"$f":"1.05*VPK6^1.4*((2*$N$5)/($N$5*$G$5))*IF($B$5=100,VPK9,VPK12)+VPK13+VPK14","v":0},0,0,0,0,0,0,0,0,0,0,0,0,0,0,0,0,0,0,0,0,0,0,0,0,0,0,0,0,0,0,0,0,0,0,0,0,0,0,0,0,0,0,0,0,0,0,0,0,0,0,0,0,0,0,0,0,0,0,0,0,0,0,0,{"$f":"1.05*VRW6^1.4*((2*$N$5)/($N$5*$G$5))*IF($B$5=100,VRW9,VRW12)+VRW13+VRW14","v":0},0,0,0,0,0,0,0,0,0,0,0,0,0,0,0,0,0,0,0,0,0,0,0,0,0,0,0,0,0,0,0,0,0,0,0,0,0,0,0,0,0,0,0,0,0,0,0,0,0,0,0,0,0,0,0,0,0,0,0,0,0,0,0,{"$f":"1.05*VUI6^1.4*((2*$N$5)/($N$5*$G$5))*IF($B$5=100,VUI9,VUI12)+VUI13+VUI14","v":0},0,0,0,0,0,0,0,0,0,0,0,0,0,0,0,0,0,0,0,0,0,0,0,0,0,0,0,0,0,0,0,0,0,0,0,0,0,0,0,0,0,0,0,0,0,0,0,0,0,0,0,0,0,0,0,0,0,0,0,0,0,0,0,{"$f":"1.05*VWU6^1.4*((2*$N$5)/($N$5*$G$5))*IF($B$5=100,VWU9,VWU12)+VWU13+VWU14","v":0},0,0,0,0,0,0,0,0,0,0,0,0,0,0,0,0,0,0,0,0,0,0,0,0,0,0,0,0,0,0,0,0,0,0,0,0,0,0,0,0,0,0,0,0,0,0,0,0,0,0,0,0,0,0,0,0,0,0,0,0,0,0,0,{"$f":"1.05*VZG6^1.4*((2*$N$5)/($N$5*$G$5))*IF($B$5=100,VZG9,VZG12)+VZG13+VZG14","v":0},0,0,0,0,0,0,0,0,0,0,0,0,0,0,0,0,0,0,0,0,0,0,0,0,0,0,0,0,0,0,0,0,0,0,0,0,0,0,0,0,0,0,0,0,0,0,0,0,0,0,0,0,0,0,0,0,0,0,0,0,0,0,0,{"$f":"1.05*WBS6^1.4*((2*$N$5)/($N$5*$G$5))*IF($B$5=100,WBS9,WBS12)+WBS13+WBS14","v":0},0,0,0,0,0,0,0,0,0,0,0,0,0,0,0,0,0,0,0,0,0,0,0,0,0,0,0,0,0,0,0,0,0,0,0,0,0,0,0,0,0,0,0,0,0,0,0,0,0,0,0,0,0,0,0,0,0,0,0,0,0,0,0,{"$f":"1.05*WEE6^1.4*((2*$N$5)/($N$5*$G$5))*IF($B$5=100,WEE9,WEE12)+WEE13+WEE14","v":0},0,0,0,0,0,0,0,0,0,0,0,0,0,0,0,0,0,0,0,0,0,0,0,0,0,0,0,0,0,0,0,0,0,0,0,0,0,0,0,0,0,0,0,0,0,0,0,0,0,0,0,0,0,0,0,0,0,0,0,0,0,0,0,{"$f":"1.05*WGQ6^1.4*((2*$N$5)/($N$5*$G$5))*IF($B$5=100,WGQ9,WGQ12)+WGQ13+WGQ14","v":0},0,0,0,0,0,0,0,0,0,0,0,0,0,0,0,0,0,0,0,0,0,0,0,0,0,0,0,0,0,0,0,0,0,0,0,0,0,0,0,0,0,0,0,0,0,0,0,0,0,0,0,0,0,0,0,0,0,0,0,0,0,0,0,{"$f":"1.05*WJC6^1.4*((2*$N$5)/($N$5*$G$5))*IF($B$5=100,WJC9,WJC12)+WJC13+WJC14","v":0},0,0,0,0,0,0,0,0,0,0,0,0,0,0,0,0,0,0,0,0,0,0,0,0,0,0,0,0,0,0,0,0,0,0,0,0,0,0,0,0,0,0,0,0,0,0,0,0,0,0,0,0,0,0,0,0,0,0,0,0,0,0,0,{"$f":"1.05*WLO6^1.4*((2*$N$5)/($N$5*$G$5))*IF($B$5=100,WLO9,WLO12)+WLO13+WLO14","v":0},0,0,0,0,0,0,0,0,0,0,0,0,0,0,0,0,0,0,0,0,0,0,0,0,0,0,0,0,0,0,0,0,0,0,0,0,0,0,0,0,0,0,0,0,0,0,0,0,0,0,0,0,0,0,0,0,0,0,0,0,0,0,0,{"$f":"1.05*WOA6^1.4*((2*$N$5)/($N$5*$G$5))*IF($B$5=100,WOA9,WOA12)+WOA13+WOA14","v":0},0,0,0,0,0,0,0,0,0,0,0,0,0,0,0,0,0,0,0,0,0,0,0,0,0,0,0,0,0,0,0,0,0,0,0,0,0,0,0,0,0,0,0,0,0,0,0,0,0,0,0,0,0,0,0,0,0,0,0,0,0,0,0,{"$f":"1.05*WQM6^1.4*((2*$N$5)/($N$5*$G$5))*IF($B$5=100,WQM9,WQM12)+WQM13+WQM14","v":0},0,0,0,0,0,0,0,0,0,0,0,0,0,0,0,0,0,0,0,0,0,0,0,0,0,0,0,0,0,0,0,0,0,0,0,0,0,0,0,0,0,0,0,0,0,0,0,0,0,0,0,0,0,0,0,0,0,0,0,0,0,0,0,{"$f":"1.05*WSY6^1.4*((2*$N$5)/($N$5*$G$5))*IF($B$5=100,WSY9,WSY12)+WSY13+WSY14","v":0},0,0,0,0,0,0,0,0,0,0,0,0,0,0,0,0,0,0,0,0,0,0,0,0,0,0,0,0,0,0,0,0,0,0,0,0,0,0,0,0,0,0,0,0,0,0,0,0,0,0,0,0,0,0,0,0,0,0,0,0,0,0,0,{"$f":"1.05*WVK6^1.4*((2*$N$5)/($N$5*$G$5))*IF($B$5=100,WVK9,WVK12)+WVK13+WVK14","v":0},0,0,0,0,0,0,0,0,0,0,0,0,0,0,0,0,0,0,0,0,0,0,0,0,0,0,0,0,0,0,0,0,0,0,0,0,0,0,0,0,0,0,0,0,0,0,0,0,0,0,0,0,0,0,0,0,0,0,0,0,0,0,0,{"$f":"1.05*WXW6^1.4*((2*$N$5)/($N$5*$G$5))*IF($B$5=100,WXW9,WXW12)+WXW13+WXW14","v":0},0,0,0,0,0,0,0,0,0,0,0,0,0,0,0,0,0,0,0,0,0,0,0,0,0,0,0,0,0,0,0,0,0,0,0,0,0,0,0,0,0,0,0,0,0,0,0,0,0,0,0,0,0,0,0,0,0,0,0,0,0,0,0,{"$f":"1.05*XAI6^1.4*((2*$N$5)/($N$5*$G$5))*IF($B$5=100,XAI9,XAI12)+XAI13+XAI14","v":0},0,0,0,0,0,0,0,0,0,0,0,0,0,0,0,0,0,0,0,0,0,0,0,0,0,0,0,0,0,0,0,0,0,0,0,0,0,0,0,0,0,0,0,0,0,0,0,0,0,0,0,0,0,0,0,0,0,0,0,0,0,0,0,{"$f":"1.05*XCU6^1.4*((2*$N$5)/($N$5*$G$5))*IF($B$5=100,XCU9,XCU12)+XCU13+XCU14","v":0},0,0,0,0,0,0,0,0,0,0,0,0,0,0,0,0,0,0,0,0,0,0,0,0,0,0,0,0,0,0,0,0,0,0,0,0,0,0,0,0,0,0,0,0,0,0,0,0,0,0,0,0,0,0,0,0,0,0,0,0,0]
["bez mínus",{"$f":"IF(B16<0,0,B16)","v":0},{"$f":"IF(C16<0,0,C16)","v":0.21050087455589359},1.7168919136409058,1.4595545094655107,1.1496609860795646,0.55306773743045812,3.0890619399766601,4.2935220778400449,4.7795589061509425,2.2527025556550533,0.81505708016073353,2.2979676952935204,4.6038959869411764,3.8517874428879848,4.8674564628412993,5.7620436542843132,8.999125774376008,11.268776993972967,10.532912540806043,9.7609510323643285,9.9171132232485313,10.033183933017463,7.7645012268057041,6.2470429385247481,5.7469949224646228,5.7620436542843132,6.715328096265381,4.7431838068471723,4.7795589061509425,4.7795589061509425,3.3627438142747872]
["regrese",16,{"$f":"TRANSPOSE(B17:AF17)","v":0},null,null,"16-63 Hz",null,null,null,null,"40-250 Hz",null,null,null,null,"160-1600 Hz",null,null,null,null,null,"400-2500 Hz",null,null,null,null,"2000-16000 Hz"]
[null,20,0.21050087455589359,null,null,{"$f":"LINEST(C18:C24,B18:B24^{1,2,3})","v":2.5385672165290074E-4},-2.9451156998499605E-2,1.0689136631346994,-10.867863726151594,null,{"$f":"LINEST(C22:C30,B22:B30^{1,2,3})","v":5.4805477180844669E-6},-2.3511826649646019E-3,0.29588160511515915,-7.7817229316704832,null,{"$f":"LINEST(C28:C36,B28:B36^{1,2,3})","v":-2.6265957909388103E-8},3.5318318223360236E-5,8.1795568551191805E-4,0.87385501516227659,null,null,{"$f":"LINEST(C32:C40,B32:B40^{1,2,3})","v":3.3844430570599713E-9},-1.8534871001085549E-5,3.0102553125052743E-2,-4.2085985579906389,null,{"$f":"LINEST(C39:C48,B39:B48^{1,2,3})","v":-8.8077165064800359E-12},2.6056949968370005E-7,-2.5186232576292853E-3,12.936428226026756]
[null,25,1.7168919136409058]
[null,31.5,1.4595545094655107,null,null,null,null,null,null,null,null,null,null,null,null,null,null,null,null,null,null,null,null,null,null,"limitní útlum",60,"dB",null,"korekce C","ano"]
[null,40,1.1496609860795646]
[null,50,0.55306773743045812]
[null,63,3.0890619399766601]
[null,80,4.2935220778400449]
[null,100,4.7795589061509425]
[null,125,2.2527025556550533]
[null,160,0.81505708016073353]
[null,200,2.2979676952935204]
[null,250,4.6038959869411764]
[null,315,3.8517874428879848]
[null,400,4.8674564628412993]
[null,500,5.7620436542843132]
[null,630,8.999125774376008]
[null,800,11.268776993972967]
[null,1000,10.532912540806043]
[null,1250,9.7609510323643285]
[null,1600,9.9171132232485313]
[null,2000,10.033183933017463]
[null,2500,7.7645012268057041]
[null,3150,6.2470429385247481]
[null,4000,5.7469949224646228]
[null,5000,5.7620436542843132]
[null,6300,6.715328096265381]
[null,8000,4.7431838068471723]
[null,10000,4.7795589061509425]
[null,12500,4.7795589061509425]
[null,16000,3.3627438142747872]
[null,16,20,25,31.5,40,50,63,80,100,125,160,200,250,315,400,500,630,800,1000,1250,1600,2000,2500,3150,4000,5000,6300,8000,10000,12500,16000]
["výpočet",{"$f":"B17","v":0},0.21050087455589359,1.7168919136409058,1.4595545094655107,1.1496609860795646,0.55306773743045812,3.0890619399766601,4.2935220778400449,4.7795589061509425,2.2527025556550533,0.81505708016073353,2.2979676952935204,4.6038959869411764,3.8517874428879848,4.8674564628412993,5.7620436542843132,8.999125774376008,11.268776993972967,10.532912540806043,9.7609510323643285,9.9171132232485313,10.033183933017463,7.7645012268057041,6.2470429385247481,5.7469949224646228,5.7620436542843132,6.715328096265381,4.7431838068471723,4.7795589061509425,4.7795589061509425,3.3627438142747872]
["regrese 1",{"$f":"$F$19*B49^3+$G$19*B49^2+$H$19*B49+$I$19","v":-0.26494417572202167},0.76080051036575824,1.4145160039802125,1.5145200907230638,1.0136617874226594,0.68201714094695731,3.0581666034324151]
["regrese 2",null,null,null,null,{"$f":"$K$19*F49^3+$L$19*F49^2+$M$19*F49+$N$19","v":0.64240406294992525},1.8194691264365286,2.8973687086039046,3.6472768534280426,3.775158648283881,3.1704433295362371,1.8173811169351488,1.1916732374530135]
["regrese 3",null,null,null,null,null,null,null,null,null,null,{"$f":"$P$19*L49^3+$Q$19*L49^2+$R$19*L49+$S$19","v":1.801291507765352},2.2400512179239649,2.8753332331660819,3.8150056846403544,5.1709468989038427,6.8291676750847818,8.8392836225176961,10.683772776915653,10.74417101464633]
["regrese 4",null,null,null,null,null,null,null,null,null,null,null,null,null,null,{"$f":"$V$19*P49^3+$W$19*P49^2+$X$19*P49+$Y$19","v":5.0834476875086096},6.6320156363968419,8.2457894435504109,9.7439613465715116,10.743526623036528,11.069097254949375,10.368895441032388,8.9325681442524303,8.0867632644185878]
["regrese 5",null,null,null,null,null,null,null,null,null,null,null,null,null,null,null,null,null,null,null,null,null,{"$f":"$AA$19*W49^3+$AB$19*W49^2+$AC$19*W49+$AD$19","v":8.8709979774511449},8.1308088845629172,7.3129729389440445,6.4673533340340938,5.756584866662827,5.2087620561124996,4.9543392934315005,4.9994291116238756,4.9650505295200027,3.2678412124431873]
["výsledek",{"$f":"B50","v":0},{"$f":"C50","v":0.21050087455589359},{"$f":"D51","v":1.4145160039802125},{"$f":"E51","v":1.5145200907230638},{"$f":"IF(F51<0,F52,AVERAGE(F51:F52))","v":0.82803292518629235},{"$f":"IF(G51<0,G52,AVERAGE(G51:G52))","v":1.2507431336917429},2.9777676560181598,{"$f":"I52","v":3.6472768534280426},3.775158648283881,3.1704433295362371,{"$f":"IF(L52<0,L53,AVERAGE(L52:L53))","v":1.8093363123502504},{"$f":"IF(M52<0,M53,AVERAGE(M52:M53))","v":1.7158622276884892},{"$f":"N53","v":2.8753332331660819},{"$f":"O53","v":3.8150056846403544},{"$f":"MEDIAN(P53:P54)","v":5.1271972932062262},{"$f":"MEDIAN(Q53:Q54)","v":6.7305916557408114},8.5425365330340526,10.213867061743581,10.743848818841428,{"$f":"U54","v":11.069097254949375},{"$f":"V54","v":10.368895441032388},{"$f":"AVERAGE(W54:W55)","v":8.9017830608517876},{"$f":"AVERAGE(X54:X55)","v":8.1087860744907516},{"$f":"Y55","v":7.3129729389440445},{"$f":"Z55","v":6.4673533340340938},5.756584866662827,5.2087620561124996,4.9543392934315005,4.9994291116238756,4.9650505295200027,3.2678412124431873]
["bez mínus",{"$f":"IF(B56<0,0,B56)","v":0},{"$f":"IF(C56<0,0,C56)","v":0.21050087455589359},1.4145160039802125,1.5145200907230638,0.82803292518629235,1.2507431336917429,2.9777676560181598,3.6472768534280426,3.775158648283881,3.1704433295362371,1.8093363123502504,1.7158622276884892,2.8753332331660819,3.8150056846403544,5.1271972932062262,6.7305916557408114,8.5425365330340526,10.213867061743581,10.743848818841428,11.069097254949375,10.368895441032388,8.9017830608517876,8.1087860744907516,7.3129729389440445,6.4673533340340938,5.756584866662827,5.2087620561124996,4.9543392934315005,4.9994291116238756,4.9650505295200027,3.2678412124431873]
["S/λ",{"$f":"SQRT($U$5)*(B2/344)","v":2.278595109565747E-2},2.8482438869571837E-2,3.5603048586964801E-2,4.485984121957564E-2,5.6964877739143674E-2,7.1206097173929603E-2,8.971968243915128E-2,0.11392975547828735,0.14241219434785921,0.17801524293482396,0.2278595109565747,0.28482438869571841,0.35603048586964792,0.44859841219575641,0.56964877739143682,0.71206097173929583,0.89719682439151283,1.1392975547828736,1.4241219434785917,1.7801524293482398,2.2785951095657473,2.8482438869571833,3.5603048586964796,4.4859841219575642,5.6964877739143667,7.1206097173929592,8.9719682439151285,11.392975547828733,14.241219434785918,17.801524293482398,22.785951095657467]
["křivka C",{"$f":"IF(B58<0.08,0,IF(B58>0.9,9,11.258*POWER(B58,3)-33.404*POWER(B58,2)+34.944*B58-2.8221))","v":0},0,0,0,0,0,0,0,0,0,0,0,0,0,0,0,0,0,0,0,0,0,0,0,0,0,0,0,0,0,0]
["přen. útl.",{"$f":"B57+B59","v":0},{"$f":"C57+C59","v":0.21050087455589359},1.4145160039802125,1.5145200907230638,0.82803292518629235,1.2507431336917429,2.9777676560181598,3.6472768534280426,3.775158648283881,3.1704433295362371,1.8093363123502504,1.7158622276884892,2.8753332331660819,3.8150056846403544,5.1271972932062262,6.7305916557408114,8.5425365330340526,10.213867061743581,10.743848818841428,11.069097254949375,10.368895441032388,8.9017830608517876,8.1087860744907516,7.3129729389440445,6.4673533340340938,5.756584866662827,5.2087620561124996,4.9543392934315005,4.9994291116238756,4.9650505295200027,3.2678412124431873]

{"sheet":"db_bun","index":6,"n_rows":24,"n_cols":16384,"rows_kept":24,"cut":false,"hidden":true,"merged":[]}
[1,2,3,4,5,6,7,8,9,10,11,12,13,14,15,16,17,18,19,20,21,22,23,24,25,26,27,28,29,30,31,32]
[null,16,20,25,31.5,40,50,63,80,100,125,160,200,250,315,400,500,630,800,1000,1250,1600,2000,2500,3150,4000,5000,6300,8000,10000,12500,16000]
[100,0,0.51999999999999957,2.6849999999999996,6.85,6.9450000000000003,3.24,8.2750000000000004,9.0750000000000011,4.1849999999999987,6.6400000000000006,1.870000000000001,2.3949999999999996,3.8100000000000023,5.48,4.8449999999999989,8.615000000000002,13.055,17.755000000000003,21.205000000000002,23.990000000000002,23.675000000000004,19.93,18.439999999999998,17.369999999999997,15.254999999999999,12.965000000000003,13.030000000000001,10.125,9,8.2550000000000008,7.39]
[150,0,0,7.0750000000000011,6.6450000000000005,6.3149999999999995,4.7100000000000009,4.7050000000000018,11.67,7.4649999999999981,4.9049999999999976,0,3.3499999999999979,4.4050000000000011,5.0199999999999996,4.0249999999999986,6.6550000000000011,9.57,15.03,18.75,19.545000000000002,16.48,11.77,9.6149999999999984,7.7099999999999973,6.7899999999999991,5.4750000000000014,6.4649999999999999,4.6950000000000003,5.1550000000000011,5.58,4.4000000000000004]
[200,0,0,7.5,7,7.5,6,6.5,10.9,4.5,3.5,0,3.2,4,4.8,3.8,7,8.6,16,19,18.8,15.5,11.6,9,7.7,5.5,5,5,4.4000000000000004,5,5.9,5]
[300,0,0,8,9,8,9,7.4,10.8,2.5,2.5,0,3.3,4,4.5,3.7,7.5,10,17,20,18.8,15,11.5,8.5,7.7,5,4.5999999999999996,4,4.5,4.9000000000000004,6,5]
[400,0,0,8.4499999999999993,11.395000000000001,12.435000000000002,14.145000000000001,8.4550000000000001,11.934999999999997,0.22999999999999687,1.0449999999999982,0,3.4650000000000034,4.9449999999999967,4.2800000000000011,3.6499999999999986,10.404999999999998,12.620000000000001,19.61,22.55,18.750000000000004,14.414999999999999,11.59,8.2199999999999989,7.8000000000000007,4.9700000000000024,4.2650000000000006,3.3250000000000028,4.93,4.93,6.0600000000000005,5.4999999999999991]
["kritéria výběru",{"$f":"COUNTIF(A3:A7,F12)","v":1},null,null,"šířka buňky",200,250,300,400]
[{"$f":"INDEX(A3:A7,MATCH(F12,A3:A7))","v":150},{"$f":"VLOOKUP($A$9,$A$3:$AF$7,B$1,FALSE)","v":0},0,7.0750000000000011,6.6450000000000005,6.3149999999999995,4.7100000000000009,4.7050000000000018,11.67,7.4649999999999981,4.9049999999999976,0,3.3499999999999979,4.4050000000000011,5.0199999999999996,4.0249999999999986,6.6550000000000011,9.57,15.03,18.75,19.545000000000002,16.48,11.77,9.6149999999999984,7.7099999999999973,6.7899999999999991,5.4750000000000014,6.4649999999999999,4.6950000000000003,5.1550000000000011,5.58,4.4000000000000004]
[{"$f":"INDEX(A3:A7,MATCH(F12,A3:A7)+1)","v":200},{"$f":"VLOOKUP($A$10,$A$3:$AF$7,B$1,FALSE)","v":0},0,7.5,7,7.5,6,6.5,10.9,4.5,3.5,0,3.2,4,4.8,3.8,7,8.6,16,19,18.8,15.5,11.6,9,7.7,5.5,5,5,4.4000000000000004,5,5.9,5]
["izol 50 výběr",{"$f":"IF($B$8=1,VLOOKUP($F$12,$A$3:$AF$7,B1,FALSE),TREND(B9:B10,$A$9:$A$10,$F$12,))","v":0},0,7.0750000000000011,6.6450000000000005,6.3149999999999995,4.7100000000000009,4.7050000000000018,11.67,7.4649999999999981,4.9049999999999976,0,3.3499999999999979,4.4050000000000011,5.0199999999999996,4.0249999999999986,6.6550000000000011,9.57,15.03,18.75,19.545000000000002,16.48,11.77,9.6149999999999984,7.7099999999999973,6.7899999999999991,5.4750000000000014,6.4649999999999999,4.6950000000000003,5.1550000000000011,5.58,4.4000000000000004]
["izolace",{"$f":"zadání!L22","v":50},{"$f":"B12/1000","v":0.05},null,"pr. mezera",{"$f":"zadání!D22-2*db_bun!B12","v":150},{"$f":"F12/1000","v":0.15},null,"délka",{"$f":"zadání!D26","v":2000},{"$f":"J12/1000","v":2},"výška",{"$f":"zadání!D24","v":600},{"$f":"M12/1000","v":0.6},null,null,"počet sloupců n",{"$f":"zadání!L24","v":5},null,"počet řad m",{"$f":"zadání!N24","v":2},null,null,null,"průt. plocha",{"$f":"G12*N12*R12*U12","v":0.89999999999999991}]
["korekce délky",0,0,0,6.5099999999999953,5.6899999999999942,0,1.5,3.5000000000000084,3.3100000000000036,7.720000000000006,0,0,2,3.1899999999999982,7.0000000000000071,5.54,16.920000000000002,18.530000000000008,21.629999999999985,15.250000000000002,7.2800000000000091,4.9000000000000057,4.3599999999999994,2.4599999999999937,3.8900000000000006,2.3299999999999983,8.9499999999999922,0.9000000000000058,1.8900000000000008,0.30999999999999872,2.7900000000000027]
[null,{"$f":"($K$12-1)*B13","v":0},{"$f":"($K$12-1)*C13","v":0},0,6.5099999999999953,5.6899999999999942,0,1.5,3.5000000000000084,3.3100000000000036,7.720000000000006,0,0,2,3.1899999999999982,7.0000000000000071,5.54,16.920000000000002,18.530000000000008,21.629999999999985,15.250000000000002,7.2800000000000091,4.9000000000000057,4.3599999999999994,2.4599999999999937,3.8900000000000006,{"$f":"($K$12-1)*AA13","v":2.3299999999999983},8.9499999999999922,0.9000000000000058,1.8900000000000008,0.30999999999999872,2.7900000000000027]
["korekce výšky",0,0,0,0,0.08,0.1,0.3,0,0,7.0000000000000007E-2,0,0,0,0.09,0.34,0.3,0.32,0.22,0.19,0.19,0.22,0.41,0.39,0.43,0.4,0.4,0.28999999999999998,0.35,0.23,0.14000000000000001,0.32]
[null,{"$f":"(1+((0.25-$N$12)/0.25))*B15*B7","v":0},{"$f":"(1+((0.25-$N$12)/0.25))*C15*C7","v":0},0,0,-0.39792,-0.56579999999999997,-1.0145999999999997,0,0,-2.9259999999999946E-2,0,0,0,-0.15407999999999999,-0.49639999999999973,-1.2485999999999993,-1.6153599999999999,-1.7256799999999997,-1.7137999999999998,-1.425,-1.2685199999999996,-1.9007599999999993,-1.2823199999999997,-1.3415999999999999,-0.79520000000000024,-0.68240000000000001,-0.38570000000000021,-0.6901999999999997,-0.45355999999999991,-0.33935999999999999,-0.70399999999999974]
[]
["utlum",{"$f":"B11+B14-B16","v":0},{"$f":"C11+C14-C16","v":0},7.0750000000000011,13.154999999999996,12.402919999999993,5.2758000000000012,7.2196000000000016,15.170000000000009,10.775000000000002,12.654260000000004,0,3.3499999999999979,6.4050000000000011,8.3640799999999977,11.521400000000005,13.4436,28.105360000000001,35.285680000000006,42.09379999999998,36.22,25.028520000000007,18.570760000000003,15.257319999999998,11.511599999999991,11.475199999999999,8.4873999999999992,15.800699999999992,6.2852000000000059,7.4985600000000012,6.2293599999999989,7.8940000000000028]
[null,{"$f":"IF(B18>60,60,IF(B18<0,0,B18))","v":0},{"$f":"IF(C18>60,60,IF(C18<0,0,C18))","v":0},7.0750000000000011,13.154999999999996,12.402919999999993,5.2758000000000012,7.2196000000000016,15.170000000000009,10.775000000000002,12.654260000000004,0,3.3499999999999979,6.4050000000000011,8.3640799999999977,11.521400000000005,13.4436,28.105360000000001,35.285680000000006,42.09379999999998,36.22,25.028520000000007,18.570760000000003,15.257319999999998,11.511599999999991,11.475199999999999,8.4873999999999992,15.800699999999992,6.2852000000000059,7.4985600000000012,6.2293599999999989,7.8940000000000028]
["počet buněk",0,0.40769230769230891,4.6554934823091254E-2,5.2262773722627762E-2,0.01,1.7283950617283911E-2,0.01,0.02,0.02,0.03,0.76898395721925106,0.77787056367432172,0.19685039370078691,0.29671532846715321,0.63137254901960804,0.41659895531050484,0.42029873611643048,0.36648831315122499,0.29969346852157508,0.24685285535639853,0.25262935586061236,0.26051179126944307,0.32017353579175717,0.34910765687967765,0.39154375614552606,0.46116467412263767,0.35579432079815793,0.40227160493827163,0.56066666666666676,0.51423379769836464,0.21677943166441144]
[null,null,null,null,null,null,null,{"$f":"$R$12*$U$12*1.02","v":10.199999999999999},null,null,{"$f":"$R$12*$U$12*1.1","v":11},null,null,{"$f":"$R$12*$U$12*2.1","v":21},null,null,{"$f":"$R$12*$U$12*3.3","v":33},null,null,{"$f":"$R$12*$U$12*5.9","v":59},null,null,{"$f":"$R$12*$U$12*5.2","v":52},null,null,{"$f":"$R$12*$U$12*4.8","v":48},null,null,{"$f":"$R$12*$U$12*4.2","v":42}]
[null,0.5,0.6,1,1,1,0,0,0,0,2,2,2,2,4,3,1,3,4,5,6,5,4,3,2,4,6,4,2,1,1,0]
["korekce hygiena",{"$f":"B22/3","v":0.16666666666666666},{"$f":"C22/3","v":0.19999999999999998},0.33333333333333331,0.33333333333333331,0.33333333333333331,0,0,0,0,0.66666666666666663,0.66666666666666663,0.66666666666666663,0.66666666666666663,1.3333333333333333,1,0.33333333333333331,1,1.3333333333333333,1.6666666666666667,2,1.6666666666666667,1.3333333333333333,1,0.66666666666666663,1.3333333333333333,2,1.3333333333333333,0.66666666666666663,0.33333333333333331,0.33333333333333331,0,0]
["přen. útl.",{"$f":"B19+B21+B23","v":0.16666666666666666},{"$f":"C19+C21+C23","v":0.19999999999999998},7.4083333333333341,13.48833333333333,12.736253333333327,5.2758000000000012,17.419600000000003,15.170000000000009,10.775000000000002,24.320926666666672,0.66666666666666663,4.0166666666666648,28.071666666666669,9.6974133333333317,12.521400000000005,46.776933333333339,29.105360000000001,36.619013333333342,102.76046666666666,38.22,26.695186666666675,71.904093333333336,16.25732,12.178266666666657,60.808533333333337,10.487399999999999,17.134033333333324,48.951866666666668,7.8318933333333343,6.5626933333333319,7.8940000000000028,{"$f":"AG19","v":0},0,0,0,0,0,0,0,0,0,0,0,0,0,0,0,0,0,0,0,0,0,0,0,0,0,0,0,0,0,0,0,0,0,{"$f":"BO19","v":0},0,0,0,0,0,0,0,0,0,0,0,0,0,0,0,0,0,0,0,0,0,0,0,0,0,0,0,0,0,0,0,0,0,0,0,0,0,0,0,0,0,0,0,0,0,0,0,0,0,0,0,0,0,0,0,0,0,0,0,0,0,0,0,{"$f":"EA19","v":0},0,0,0,0,0,0,0,0,0,0,0,0,0,0,0,0,0,0,0,0,0,0,0,0,0,0,0,0,0,0,0,0,0,0,0,0,0,0,0,0,0,0,0,0,0,0,0,0,0,0,0,0,0,0,0,0,0,0,0,0,0,0,0,{"$f":"GM19","v":0},0,0,0,0,0,0,0,0,0,0,0,0,0,0,0,0,0,0,0,0,0,0,0,0,0,0,0,0,0,0,0,0,0,0,0,0,0,0,0,0,0,0,0,0,0,0,0,0,0,0,0,0,0,0,0,0,0,0,0,0,0,0,0,{"$f":"IY19","v":0},0,0,0,0,0,0,0,0,0,0,0,0,0,0,0,0,0,0,0,0,0,0,0,0,0,0,0,0,0,0,0,0,0,0,0,0,0,0,0,0,0,0,0,0,0,0,0,0,0,0,0,0,0,0,0,0,0,0,0,0,0,0,0,{"$f":"LK19","v":0},0,0,0,0,0,0,0,0,0,0,0,0,0,0,0,0,0,0,0,0,0,0,0,0,0,0,0,0,0,0,0,0,0,0,0,0,0,0,0,0,0,0,0,0,0,0,0,0,0,0,0,0,0,0,0,0,0,0,0,0,0,0,0,{"$f":"NW19","v":0},0,0,0,0,0,0,0,0,0,0,0,0,0,0,0,0,0,0,0,0,0,0,0,0,0,0,0,0,0,0,0,0,0,0,0,0,0,0,0,0,0,0,0,0,0,0,0,0,0,0,0,0,0,0,0,0,0,0,0,0,0,0,0,{"$f":"QI19","v":0},0,0,0,0,0,0,0,0,0,0,0,0,0,0,0,0,0,0,0,0,0,0,0,0,0,0,0,0,0,0,0,0,0,0,0,0,0,0,0,0,0,0,0,0,0,0,0,0,0,0,0,0,0,0,0,0,0,0,0,0,0,0,0,{"$f":"SU19","v":0},0,0,0,0,0,0,0,0,0,0,0,0,0,0,0,0,0,0,0,0,0,0,0,0,0,0,0,0,0,0,0,0,0,0,0,0,0,0,0,0,0,0,0,0,0,0,0,0,0,0,0,0,0,0,0,0,0,0,0,0,0,0,0,{"$f":"VG19","v":0},0,0,0,0,0,0,0,0,0,0,0,0,0,0,0,0,0,0,0,0,0,0,0,0,0,0,0,0,0,0,0,0,0,0,0,0,0,0,0,0,0,0,0,0,0,0,0,0,0,0,0,0,0,0,0,0,0,0,0,0,0,0,0,{"$f":"XS19","v":0},0,0,0,0,0,0,0,0,0,0,0,0,0,0,0,0,0,0,0,0,0,0,0,0,0,0,0,0,0,0,0,0,0,0,0,0,0,0,0,0,0,0,0,0,0,0,0,0,0,0,0,0,0,0,0,0,0,0,0,0,0,0,0,{"$f":"AAE19","v":0},0,0,0,0,0,0,0,0,0,0,0,0,0,0,0,0,0,0,0,0,0,0,0,0,0,0,0,0,0,0,0,0,0,0,0,0,0,0,0,0,0,0,0,0,0,0,0,0,0,0,0,0,0,0,0,0,0,0,0,0,0,0,0,{"$f":"ACQ19","v":0},0,0,0,0,0,0,0,0,0,0,0,0,0,0,0,0,0,0,0,0,0,0,0,0,0,0,0,0,0,0,0,0,0,0,0,0,0,0,0,0,0,0,0,0,0,0,0,0,0,0,0,0,0,0,0,0,0,0,0,0,0,0,0,{"$f":"AFC19","v":0},0,0,0,0,0,0,0,0,0,0,0,0,0,0,0,0,0,0,0,0,0,0,0,0,0,0,0,0,0,0,0,0,0,0,0,0,0,0,0,0,0,0,0,0,0,0,0,0,0,0,0,0,0,0,0,0,0,0,0,0,0,0,0,{"$f":"AHO19","v":0},0,0,0,0,0,0,0,0,0,0,0,0,0,0,0,0,0,0,0,0,0,0,0,0,0,0,0,0,0,0,0,0,0,0,0,0,0,0,0,0,0,0,0,0,0,0,0,0,0,0,0,0,0,0,0,0,0,0,0,0,0,0,0,{"$f":"AKA19","v":0},0,0,0,0,0,0,0,0,0,0,0,0,0,0,0,0,0,0,0,0,0,0,0,0,0,0,0,0,0,0,0,0,0,0,0,0,0,0,0,0,0,0,0,0,0,0,0,0,0,0,0,0,0,0,0,0,0,0,0,0,0,0,0,{"$f":"AMM19","v":0},0,0,0,0,0,0,0,0,0,0,0,0,0,0,0,0,0,0,0,0,0,0,0,0,0,0,0,0,0,0,0,0,0,0,0,0,0,0,0,0,0,0,0,0,0,0,0,0,0,0,0,0,0,0,0,0,0,0,0,0,0,0,0,{"$f":"AOY19","v":0},0,0,0,0,0,0,0,0,0,0,0,0,0,0,0,0,0,0,0,0,0,0,0,0,0,0,0,0,0,0,0,0,0,0,0,0,0,0,0,0,0,0,0,0,0,0,0,0,0,0,0,0,0,0,0,0,0,0,0,0,0,0,0,{"$f":"ARK19","v":0},0,0,0,0,0,0,0,0,0,0,0,0,0,0,0,0,0,0,0,0,0,0,0,0,0,0,0,0,0,0,0,0,0,0,0,0,0,0,0,0,0,0,0,0,0,0,0,0,0,0,0,0,0,0,0,0,0,0,0,0,0,0,0,{"$f":"ATW19","v":0},0,0,0,0,0,0,0,0,0,0,0,0,0,0,0,0,0,0,0,0,0,0,0,0,0,0,0,0,0,0,0,0,0,0,0,0,0,0,0,0,0,0,0,0,0,0,0,0,0,0,0,0,0,0,0,0,0,0,0,0,0,0,0,{"$f":"AWI19","v":0},0,0,0,0,0,0,0,0,0,0,0,0,0,0,0,0,0,0,0,0,0,0,0,0,0,0,0,0,0,0,0,0,0,0,0,0,0,0,0,0,0,0,0,0,0,0,0,0,0,0,0,0,0,0,0,0,0,0,0,0,0,0,0,{"$f":"AYU19","v":0},0,0,0,0,0,0,0,0,0,0,0,0,0,0,0,0,0,0,0,0,0,0,0,0,0,0,0,0,0,0,0,0,0,0,0,0,0,0,0,0,0,0,0,0,0,0,0,0,0,0,0,0,0,0,0,0,0,0,0,0,0,0,0,{"$f":"BBG19","v":0},0,0,0,0,0,0,0,0,0,0,0,0,0,0,0,0,0,0,0,0,0,0,0,0,0,0,0,0,0,0,0,0,0,0,0,0,0,0,0,0,0,0,0,0,0,0,0,0,0,0,0,0,0,0,0,0,0,0,0,0,0,0,0,{"$f":"BDS19","v":0},0,0,0,0,0,0,0,0,0,0,0,0,0,0,0,0,0,0,0,0,0,0,0,0,0,0,0,0,0,0,0,0,0,0,0,0,0,0,0,0,0,0,0,0,0,0,0,0,0,0,0,0,0,0,0,0,0,0,0,0,0,0,0,{"$f":"BGE19","v":0},0,0,0,0,0,0,0,0,0,0,0,0,0,0,0,0,0,0,0,0,0,0,0,0,0,0,0,0,0,0,0,0,0,0,0,0,0,0,0,0,0,0,0,0,0,0,0,0,0,0,0,0,0,0,0,0,0,0,0,0,0,0,0,{"$f":"BIQ19","v":0},0,0,0,0,0,0,0,0,0,0,0,0,0,0,0,0,0,0,0,0,0,0,0,0,0,0,0,0,0,0,0,0,0,0,0,0,0,0,0,0,0,0,0,0,0,0,0,0,0,0,0,0,0,0,0,0,0,0,0,0,0,0,0,{"$f":"BLC19","v":0},0,0,0,0,0,0,0,0,0,0,0,0,0,0,0,0,0,0,0,0,0,0,0,0,0,0,0,0,0,0,0,0,0,0,0,0,0,0,0,0,0,0,0,0,0,0,0,0,0,0,0,0,0,0,0,0,0,0,0,0,0,0,0,{"$f":"BNO19","v":0},0,0,0,0,0,0,0,0,0,0,0,0,0,0,0,0,0,0,0,0,0,0,0,0,0,0,0,0,0,0,0,0,0,0,0,0,0,0,0,0,0,0,0,0,0,0,0,0,0,0,0,0,0,0,0,0,0,0,0,0,0,0,0,{"$f":"BQA19","v":0},0,0,0,0,0,0,0,0,0,0,0,0,0,0,0,0,0,0,0,0,0,0,0,0,0,0,0,0,0,0,0,0,0,0,0,0,0,0,0,0,0,0,0,0,0,0,0,0,0,0,0,0,0,0,0,0,0,0,0,0,0,0,0,{"$f":"BSM19","v":0},0,0,0,0,0,0,0,0,0,0,0,0,0,0,0,0,0,0,0,0,0,0,0,0,0,0,0,0,0,0,0,0,0,0,0,0,0,0,0,0,0,0,0,0,0,0,0,0,0,0,0,0,0,0,0,0,0,0,0,0,0,0,0,{"$f":"BUY19","v":0},0,0,0,0,0,0,0,0,0,0,0,0,0,0,0,0,0,0,0,0,0,0,0,0,0,0,0,0,0,0,0,0,0,0,0,0,0,0,0,0,0,0,0,0,0,0,0,0,0,0,0,0,0,0,0,0,0,0,0,0,0,0,0,{"$f":"BXK19","v":0},0,0,0,0,0,0,0,0,0,0,0,0,0,0,0,0,0,0,0,0,0,0,0,0,0,0,0,0,0,0,0,0,0,0,0,0,0,0,0,0,0,0,0,0,0,0,0,0,0,0,0,0,0,0,0,0,0,0,0,0,0,0,0,{"$f":"BZW19","v":0},0,0,0,0,0,0,0,0,0,0,0,0,0,0,0,0,0,0,0,0,0,0,0,0,0,0,0,0,0,0,0,0,0,0,0,0,0,0,0,0,0,0,0,0,0,0,0,0,0,0,0,0,0,0,0,0,0,0,0,0,0,0,0,{"$f":"CCI19","v":0},0,0,0,0,0,0,0,0,0,0,0,0,0,0,0,0,0,0,0,0,0,0,0,0,0,0,0,0,0,0,0,0,0,0,0,0,0,0,0,0,0,0,0,0,0,0,0,0,0,0,0,0,0,0,0,0,0,0,0,0,0,0,0,{"$f":"CEU19","v":0},0,0,0,0,0,0,0,0,0,0,0,0,0,0,0,0,0,0,0,0,0,0,0,0,0,0,0,0,0,0,0,0,0,0,0,0,0,0,0,0,0,0,0,0,0,0,0,0,0,0,0,0,0,0,0,0,0,0,0,0,0,0,0,{"$f":"CHG19","v":0},0,0,0,0,0,0,0,0,0,0,0,0,0,0,0,0,0,0,0,0,0,0,0,0,0,0,0,0,0,0,0,0,0,0,0,0,0,0,0,0,0,0,0,0,0,0,0,0,0,0,0,0,0,0,0,0,0,0,0,0,0,0,0,{"$f":"CJS19","v":0},0,0,0,0,0,0,0,0,0,0,0,0,0,0,0,0,0,0,0,0,0,0,0,0,0,0,0,0,0,0,0,0,0,0,0,0,0,0,0,0,0,0,0,0,0,0,0,0,0,0,0,0,0,0,0,0,0,0,0,0,0,0,0,{"$f":"CME19","v":0},0,0,0,0,0,0,0,0,0,0,0,0,0,0,0,0,0,0,0,0,0,0,0,0,0,0,0,0,0,0,0,0,0,0,0,0,0,0,0,0,0,0,0,0,0,0,0,0,0,0,0,0,0,0,0,0,0,0,0,0,0,0,0,{"$f":"COQ19","v":0},0,0,0,0,0,0,0,0,0,0,0,0,0,0,0,0,0,0,0,0,0,0,0,0,0,0,0,0,0,0,0,0,0,0,0,0,0,0,0,0,0,0,0,0,0,0,0,0,0,0,0,0,0,0,0,0,0,0,0,0,0,0,0,{"$f":"CRC19","v":0},0,0,0,0,0,0,0,0,0,0,0,0,0,0,0,0,0,0,0,0,0,0,0,0,0,0,0,0,0,0,0,0,0,0,0,0,0,0,0,0,0,0,0,0,0,0,0,0,0,0,0,0,0,0,0,0,0,0,0,0,0,0,0,{"$f":"CTO19","v":0},0,0,0,0,0,0,0,0,0,0,0,0,0,0,0,0,0,0,0,0,0,0,0,0,0,0,0,0,0,0,0,0,0,0,0,0,0,0,0,0,0,0,0,0,0,0,0,0,0,0,0,0,0,0,0,0,0,0,0,0,0,0,0,{"$f":"CWA19","v":0},0,0,0,0,0,0,0,0,0,0,0,0,0,0,0,0,0,0,0,0,0,0,0,0,0,0,0,0,0,0,0,0,0,0,0,0,0,0,0,0,0,0,0,0,0,0,0,0,0,0,0,0,0,0,0,0,0,0,0,0,0,0,0,{"$f":"CYM19","v":0},0,0,0,0,0,0,0,0,0,0,0,0,0,0,0,0,0,0,0,0,0,0,0,0,0,0,0,0,0,0,0,0,0,0,0,0,0,0,0,0,0,0,0,0,0,0,0,0,0,0,0,0,0,0,0,0,0,0,0,0,0,0,0,{"$f":"DAY19","v":0},0,0,0,0,0,0,0,0,0,0,0,0,0,0,0,0,0,0,0,0,0,0,0,0,0,0,0,0,0,0,0,0,0,0,0,0,0,0,0,0,0,0,0,0,0,0,0,0,0,0,0,0,0,0,0,0,0,0,0,0,0,0,0,{"$f":"DDK19","v":0},0,0,0,0,0,0,0,0,0,0,0,0,0,0,0,0,0,0,0,0,0,0,0,0,0,0,0,0,0,0,0,0,0,0,0,0,0,0,0,0,0,0,0,0,0,0,0,0,0,0,0,0,0,0,0,0,0,0,0,0,0,0,0,{"$f":"DFW19","v":0},0,0,0,0,0,0,0,0,0,0,0,0,0,0,0,0,0,0,0,0,0,0,0,0,0,0,0,0,0,0,0,0,0,0,0,0,0,0,0,0,0,0,0,0,0,0,0,0,0,0,0,0,0,0,0,0,0,0,0,0,0,0,0,{"$f":"DII19","v":0},0,0,0,0,0,0,0,0,0,0,0,0,0,0,0,0,0,0,0,0,0,0,0,0,0,0,0,0,0,0,0,0,0,0,0,0,0,0,0,0,0,0,0,0,0,0,0,0,0,0,0,0,0,0,0,0,0,0,0,0,0,0,0,{"$f":"DKU19","v":0},0,0,0,0,0,0,0,0,0,0,0,0,0,0,0,0,0,0,0,0,0,0,0,0,0,0,0,0,0,0,0,0,0,0,0,0,0,0,0,0,0,0,0,0,0,0,0,0,0,0,0,0,0,0,0,0,0,0,0,0,0,0,0,{"$f":"DNG19","v":0},0,0,0,0,0,0,0,0,0,0,0,0,0,0,0,0,0,0,0,0,0,0,0,0,0,0,0,0,0,0,0,0,0,0,0,0,0,0,0,0,0,0,0,0,0,0,0,0,0,0,0,0,0,0,0,0,0,0,0,0,0,0,0,{"$f":"DPS19","v":0},0,0,0,0,0,0,0,0,0,0,0,0,0,0,0,0,0,0,0,0,0,0,0,0,0,0,0,0,0,0,0,0,0,0,0,0,0,0,0,0,0,0,0,0,0,0,0,0,0,0,0,0,0,0,0,0,0,0,0,0,0,0,0,{"$f":"DSE19","v":0},0,0,0,0,0,0,0,0,0,0,0,0,0,0,0,0,0,0,0,0,0,0,0,0,0,0,0,0,0,0,0,0,0,0,0,0,0,0,0,0,0,0,0,0,0,0,0,0,0,0,0,0,0,0,0,0,0,0,0,0,0,0,0,{"$f":"DUQ19","v":0},0,0,0,0,0,0,0,0,0,0,0,0,0,0,0,0,0,0,0,0,0,0,0,0,0,0,0,0,0,0,0,0,0,0,0,0,0,0,0,0,0,0,0,0,0,0,0,0,0,0,0,0,0,0,0,0,0,0,0,0,0,0,0,{"$f":"DXC19","v":0},0,0,0,0,0,0,0,0,0,0,0,0,0,0,0,0,0,0,0,0,0,0,0,0,0,0,0,0,0,0,0,0,0,0,0,0,0,0,0,0,0,0,0,0,0,0,0,0,0,0,0,0,0,0,0,0,0,0,0,0,0,0,0,{"$f":"DZO19","v":0},0,0,0,0,0,0,0,0,0,0,0,0,0,0,0,0,0,0,0,0,0,0,0,0,0,0,0,0,0,0,0,0,0,0,0,0,0,0,0,0,0,0,0,0,0,0,0,0,0,0,0,0,0,0,0,0,0,0,0,0,0,0,0,{"$f":"ECA19","v":0},0,0,0,0,0,0,0,0,0,0,0,0,0,0,0,0,0,0,0,0,0,0,0,0,0,0,0,0,0,0,0,0,0,0,0,0,0,0,0,0,0,0,0,0,0,0,0,0,0,0,0,0,0,0,0,0,0,0,0,0,0,0,0,{"$f":"EEM19","v":0},0,0,0,0,0,0,0,0,0,0,0,0,0,0,0,0,0,0,0,0,0,0,0,0,0,0,0,0,0,0,0,0,0,0,0,0,0,0,0,0,0,0,0,0,0,0,0,0,0,0,0,0,0,0,0,0,0,0,0,0,0,0,0,{"$f":"EGY19","v":0},0,0,0,0,0,0,0,0,0,0,0,0,0,0,0,0,0,0,0,0,0,0,0,0,0,0,0,0,0,0,0,0,0,0,0,0,0,0,0,0,0,0,0,0,0,0,0,0,0,0,0,0,0,0,0,0,0,0,0,0,0,0,0,{"$f":"EJK19","v":0},0,0,0,0,0,0,0,0,0,0,0,0,0,0,0,0,0,0,0,0,0,0,0,0,0,0,0,0,0,0,0,0,0,0,0,0,0,0,0,0,0,0,0,0,0,0,0,0,0,0,0,0,0,0,0,0,0,0,0,0,0,0,0,{"$f":"ELW19","v":0},0,0,0,0,0,0,0,0,0,0,0,0,0,0,0,0,0,0,0,0,0,0,0,0,0,0,0,0,0,0,0,0,0,0,0,0,0,0,0,0,0,0,0,0,0,0,0,0,0,0,0,0,0,0,0,0,0,0,0,0,0,0,0,{"$f":"EOI19","v":0},0,0,0,0,0,0,0,0,0,0,0,0,0,0,0,0,0,0,0,0,0,0,0,0,0,0,0,0,0,0,0,0,0,0,0,0,0,0,0,0,0,0,0,0,0,0,0,0,0,0,0,0,0,0,0,0,0,0,0,0,0,0,0,{"$f":"EQU19","v":0},0,0,0,0,0,0,0,0,0,0,0,0,0,0,0,0,0,0,0,0,0,0,0,0,0,0,0,0,0,0,0,0,0,0,0,0,0,0,0,0,0,0,0,0,0,0,0,0,0,0,0,0,0,0,0,0,0,0,0,0,0,0,0,{"$f":"ETG19","v":0},0,0,0,0,0,0,0,0,0,0,0,0,0,0,0,0,0,0,0,0,0,0,0,0,0,0,0,0,0,0,0,0,0,0,0,0,0,0,0,0,0,0,0,0,0,0,0,0,0,0,0,0,0,0,0,0,0,0,0,0,0,0,0,{"$f":"EVS19","v":0},0,0,0,0,0,0,0,0,0,0,0,0,0,0,0,0,0,0,0,0,0,0,0,0,0,0,0,0,0,0,0,0,0,0,0,0,0,0,0,0,0,0,0,0,0,0,0,0,0,0,0,0,0,0,0,0,0,0,0,0,0,0,0,{"$f":"EYE19","v":0},0,0,0,0,0,0,0,0,0,0,0,0,0,0,0,0,0,0,0,0,0,0,0,0,0,0,0,0,0,0,0,0,0,0,0,0,0,0,0,0,0,0,0,0,0,0,0,0,0,0,0,0,0,0,0,0,0,0,0,0,0,0,0,{"$f":"FAQ19","v":0},0,0,0,0,0,0,0,0,0,0,0,0,0,0,0,0,0,0,0,0,0,0,0,0,0,0,0,0,0,0,0,0,0,0,0,0,0,0,0,0,0,0,0,0,0,0,0,0,0,0,0,0,0,0,0,0,0,0,0,0,0,0,0,{"$f":"FDC19","v":0},0,0,0,0,0,0,0,0,0,0,0,0,0,0,0,0,0,0,0,0,0,0,0,0,0,0,0,0,0,0,0,0,0,0,0,0,0,0,0,0,0,0,0,0,0,0,0,0,0,0,0,0,0,0,0,0,0,0,0,0,0,0,0,{"$f":"FFO19","v":0},0,0,0,0,0,0,0,0,0,0,0,0,0,0,0,0,0,0,0,0,0,0,0,0,0,0,0,0,0,0,0,0,0,0,0,0,0,0,0,0,0,0,0,0,0,0,0,0,0,0,0,0,0,0,0,0,0,0,0,0,0,0,0,{"$f":"FIA19","v":0},0,0,0,0,0,0,0,0,0,0,0,0,0,0,0,0,0,0,0,0,0,0,0,0,0,0,0,0,0,0,0,0,0,0,0,0,0,0,0,0,0,0,0,0,0,0,0,0,0,0,0,0,0,0,0,0,0,0,0,0,0,0,0,{"$f":"FKM19","v":0},0,0,0,0,0,0,0,0,0,0,0,0,0,0,0,0,0,0,0,0,0,0,0,0,0,0,0,0,0,0,0,0,0,0,0,0,0,0,0,0,0,0,0,0,0,0,0,0,0,0,0,0,0,0,0,0,0,0,0,0,0,0,0,{"$f":"FMY19","v":0},0,0,0,0,0,0,0,0,0,0,0,0,0,0,0,0,0,0,0,0,0,0,0,0,0,0,0,0,0,0,0,0,0,0,0,0,0,0,0,0,0,0,0,0,0,0,0,0,0,0,0,0,0,0,0,0,0,0,0,0,0,0,0,{"$f":"FPK19","v":0},0,0,0,0,0,0,0,0,0,0,0,0,0,0,0,0,0,0,0,0,0,0,0,0,0,0,0,0,0,0,0,0,0,0,0,0,0,0,0,0,0,0,0,0,0,0,0,0,0,0,0,0,0,0,0,0,0,0,0,0,0,0,0,{"$f":"FRW19","v":0},0,0,0,0,0,0,0,0,0,0,0,0,0,0,0,0,0,0,0,0,0,0,0,0,0,0,0,0,0,0,0,0,0,0,0,0,0,0,0,0,0,0,0,0,0,0,0,0,0,0,0,0,0,0,0,0,0,0,0,0,0,0,0,{"$f":"FUI19","v":0},0,0,0,0,0,0,0,0,0,0,0,0,0,0,0,0,0,0,0,0,0,0,0,0,0,0,0,0,0,0,0,0,0,0,0,0,0,0,0,0,0,0,0,0,0,0,0,0,0,0,0,0,0,0,0,0,0,0,0,0,0,0,0,{"$f":"FWU19","v":0},0,0,0,0,0,0,0,0,0,0,0,0,0,0,0,0,0,0,0,0,0,0,0,0,0,0,0,0,0,0,0,0,0,0,0,0,0,0,0,0,0,0,0,0,0,0,0,0,0,0,0,0,0,0,0,0,0,0,0,0,0,0,0,{"$f":"FZG19","v":0},0,0,0,0,0,0,0,0,0,0,0,0,0,0,0,0,0,0,0,0,0,0,0,0,0,0,0,0,0,0,0,0,0,0,0,0,0,0,0,0,0,0,0,0,0,0,0,0,0,0,0,0,0,0,0,0,0,0,0,0,0,0,0,{"$f":"GBS19","v":0},0,0,0,0,0,0,0,0,0,0,0,0,0,0,0,0,0,0,0,0,0,0,0,0,0,0,0,0,0,0,0,0,0,0,0,0,0,0,0,0,0,0,0,0,0,0,0,0,0,0,0,0,0,0,0,0,0,0,0,0,0,0,0,{"$f":"GEE19","v":0},0,0,0,0,0,0,0,0,0,0,0,0,0,0,0,0,0,0,0,0,0,0,0,0,0,0,0,0,0,0,0,0,0,0,0,0,0,0,0,0,0,0,0,0,0,0,0,0,0,0,0,0,0,0,0,0,0,0,0,0,0,0,0,{"$f":"GGQ19","v":0},0,0,0,0,0,0,0,0,0,0,0,0,0,0,0,0,0,0,0,0,0,0,0,0,0,0,0,0,0,0,0,0,0,0,0,0,0,0,0,0,0,0,0,0,0,0,0,0,0,0,0,0,0,0,0,0,0,0,0,0,0,0,0,{"$f":"GJC19","v":0},0,0,0,0,0,0,0,0,0,0,0,0,0,0,0,0,0,0,0,0,0,0,0,0,0,0,0,0,0,0,0,0,0,0,0,0,0,0,0,0,0,0,0,0,0,0,0,0,0,0,0,0,0,0,0,0,0,0,0,0,0,0,0,{"$f":"GLO19","v":0},0,0,0,0,0,0,0,0,0,0,0,0,0,0,0,0,0,0,0,0,0,0,0,0,0,0,0,0,0,0,0,0,0,0,0,0,0,0,0,0,0,0,0,0,0,0,0,0,0,0,0,0,0,0,0,0,0,0,0,0,0,0,0,{"$f":"GOA19","v":0},0,0,0,0,0,0,0,0,0,0,0,0,0,0,0,0,0,0,0,0,0,0,0,0,0,0,0,0,0,0,0,0,0,0,0,0,0,0,0,0,0,0,0,0,0,0,0,0,0,0,0,0,0,0,0,0,0,0,0,0,0,0,0,{"$f":"GQM19","v":0},0,0,0,0,0,0,0,0,0,0,0,0,0,0,0,0,0,0,0,0,0,0,0,0,0,0,0,0,0,0,0,0,0,0,0,0,0,0,0,0,0,0,0,0,0,0,0,0,0,0,0,0,0,0,0,0,0,0,0,0,0,0,0,{"$f":"GSY19","v":0},0,0,0,0,0,0,0,0,0,0,0,0,0,0,0,0,0,0,0,0,0,0,0,0,0,0,0,0,0,0,0,0,0,0,0,0,0,0,0,0,0,0,0,0,0,0,0,0,0,0,0,0,0,0,0,0,0,0,0,0,0,0,0,{"$f":"GVK19","v":0},0,0,0,0,0,0,0,0,0,0,0,0,0,0,0,0,0,0,0,0,0,0,0,0,0,0,0,0,0,0,0,0,0,0,0,0,0,0,0,0,0,0,0,0,0,0,0,0,0,0,0,0,0,0,0,0,0,0,0,0,0,0,0,{"$f":"GXW19","v":0},0,0,0,0,0,0,0,0,0,0,0,0,0,0,0,0,0,0,0,0,0,0,0,0,0,0,0,0,0,0,0,0,0,0,0,0,0,0,0,0,0,0,0,0,0,0,0,0,0,0,0,0,0,0,0,0,0,0,0,0,0,0,0,{"$f":"HAI19","v":0},0,0,0,0,0,0,0,0,0,0,0,0,0,0,0,0,0,0,0,0,0,0,0,0,0,0,0,0,0,0,0,0,0,0,0,0,0,0,0,0,0,0,0,0,0,0,0,0,0,0,0,0,0,0,0,0,0,0,0,0,0,0,0,{"$f":"HCU19","v":0},0,0,0,0,0,0,0,0,0,0,0,0,0,0,0,0,0,0,0,0,0,0,0,0,0,0,0,0,0,0,0,0,0,0,0,0,0,0,0,0,0,0,0,0,0,0,0,0,0,0,0,0,0,0,0,0,0,0,0,0,0,0,0,{"$f":"HFG19","v":0},0,0,0,0,0,0,0,0,0,0,0,0,0,0,0,0,0,0,0,0,0,0,0,0,0,0,0,0,0,0,0,0,0,0,0,0,0,0,0,0,0,0,0,0,0,0,0,0,0,0,0,0,0,0,0,0,0,0,0,0,0,0,0,{"$f":"HHS19","v":0},0,0,0,0,0,0,0,0,0,0,0,0,0,0,0,0,0,0,0,0,0,0,0,0,0,0,0,0,0,0,0,0,0,0,0,0,0,0,0,0,0,0,0,0,0,0,0,0,0,0,0,0,0,0,0,0,0,0,0,0,0,0,0,{"$f":"HKE19","v":0},0,0,0,0,0,0,0,0,0,0,0,0,0,0,0,0,0,0,0,0,0,0,0,0,0,0,0,0,0,0,0,0,0,0,0,0,0,0,0,0,0,0,0,0,0,0,0,0,0,0,0,0,0,0,0,0,0,0,0,0,0,0,0,{"$f":"HMQ19","v":0},0,0,0,0,0,0,0,0,0,0,0,0,0,0,0,0,0,0,0,0,0,0,0,0,0,0,0,0,0,0,0,0,0,0,0,0,0,0,0,0,0,0,0,0,0,0,0,0,0,0,0,0,0,0,0,0,0,0,0,0,0,0,0,{"$f":"HPC19","v":0},0,0,0,0,0,0,0,0,0,0,0,0,0,0,0,0,0,0,0,0,0,0,0,0,0,0,0,0,0,0,0,0,0,0,0,0,0,0,0,0,0,0,0,0,0,0,0,0,0,0,0,0,0,0,0,0,0,0,0,0,0,0,0,{"$f":"HRO19","v":0},0,0,0,0,0,0,0,0,0,0,0,0,0,0,0,0,0,0,0,0,0,0,0,0,0,0,0,0,0,0,0,0,0,0,0,0,0,0,0,0,0,0,0,0,0,0,0,0,0,0,0,0,0,0,0,0,0,0,0,0,0,0,0,{"$f":"HUA19","v":0},0,0,0,0,0,0,0,0,0,0,0,0,0,0,0,0,0,0,0,0,0,0,0,0,0,0,0,0,0,0,0,0,0,0,0,0,0,0,0,0,0,0,0,0,0,0,0,0,0,0,0,0,0,0,0,0,0,0,0,0,0,0,0,{"$f":"HWM19","v":0},0,0,0,0,0,0,0,0,0,0,0,0,0,0,0,0,0,0,0,0,0,0,0,0,0,0,0,0,0,0,0,0,0,0,0,0,0,0,0,0,0,0,0,0,0,0,0,0,0,0,0,0,0,0,0,0,0,0,0,0,0,0,0,{"$f":"HYY19","v":0},0,0,0,0,0,0,0,0,0,0,0,0,0,0,0,0,0,0,0,0,0,0,0,0,0,0,0,0,0,0,0,0,0,0,0,0,0,0,0,0,0,0,0,0,0,0,0,0,0,0,0,0,0,0,0,0,0,0,0,0,0,0,0,{"$f":"IBK19","v":0},0,0,0,0,0,0,0,0,0,0,0,0,0,0,0,0,0,0,0,0,0,0,0,0,0,0,0,0,0,0,0,0,0,0,0,0,0,0,0,0,0,0,0,0,0,0,0,0,0,0,0,0,0,0,0,0,0,0,0,0,0,0,0,{"$f":"IDW19","v":0},0,0,0,0,0,0,0,0,0,0,0,0,0,0,0,0,0,0,0,0,0,0,0,0,0,0,0,0,0,0,0,0,0,0,0,0,0,0,0,0,0,0,0,0,0,0,0,0,0,0,0,0,0,0,0,0,0,0,0,0,0,0,0,{"$f":"IGI19","v":0},0,0,0,0,0,0,0,0,0,0,0,0,0,0,0,0,0,0,0,0,0,0,0,0,0,0,0,0,0,0,0,0,0,0,0,0,0,0,0,0,0,0,0,0,0,0,0,0,0,0,0,0,0,0,0,0,0,0,0,0,0,0,0,{"$f":"IIU19","v":0},0,0,0,0,0,0,0,0,0,0,0,0,0,0,0,0,0,0,0,0,0,0,0,0,0,0,0,0,0,0,0,0,0,0,0,0,0,0,0,0,0,0,0,0,0,0,0,0,0,0,0,0,0,0,0,0,0,0,0,0,0,0,0,{"$f":"ILG19","v":0},0,0,0,0,0,0,0,0,0,0,0,0,0,0,0,0,0,0,0,0,0,0,0,0,0,0,0,0,0,0,0,0,0,0,0,0,0,0,0,0,0,0,0,0,0,0,0,0,0,0,0,0,0,0,0,0,0,0,0,0,0,0,0,{"$f":"INS19","v":0},0,0,0,0,0,0,0,0,0,0,0,0,0,0,0,0,0,0,0,0,0,0,0,0,0,0,0,0,0,0,0,0,0,0,0,0,0,0,0,0,0,0,0,0,0,0,0,0,0,0,0,0,0,0,0,0,0,0,0,0,0,0,0,{"$f":"IQE19","v":0},0,0,0,0,0,0,0,0,0,0,0,0,0,0,0,0,0,0,0,0,0,0,0,0,0,0,0,0,0,0,0,0,0,0,0,0,0,0,0,0,0,0,0,0,0,0,0,0,0,0,0,0,0,0,0,0,0,0,0,0,0,0,0,{"$f":"ISQ19","v":0},0,0,0,0,0,0,0,0,0,0,0,0,0,0,0,0,0,0,0,0,0,0,0,0,0,0,0,0,0,0,0,0,0,0,0,0,0,0,0,0,0,0,0,0,0,0,0,0,0,0,0,0,0,0,0,0,0,0,0,0,0,0,0,{"$f":"IVC19","v":0},0,0,0,0,0,0,0,0,0,0,0,0,0,0,0,0,0,0,0,0,0,0,0,0,0,0,0,0,0,0,0,0,0,0,0,0,0,0,0,0,0,0,0,0,0,0,0,0,0,0,0,0,0,0,0,0,0,0,0,0,0,0,0,{"$f":"IXO19","v":0},0,0,0,0,0,0,0,0,0,0,0,0,0,0,0,0,0,0,0,0,0,0,0,0,0,0,0,0,0,0,0,0,0,0,0,0,0,0,0,0,0,0,0,0,0,0,0,0,0,0,0,0,0,0,0,0,0,0,0,0,0,0,0,{"$f":"JAA19","v":0},0,0,0,0,0,0,0,0,0,0,0,0,0,0,0,0,0,0,0,0,0,0,0,0,0,0,0,0,0,0,0,0,0,0,0,0,0,0,0,0,0,0,0,0,0,0,0,0,0,0,0,0,0,0,0,0,0,0,0,0,0,0,0,{"$f":"JCM19","v":0},0,0,0,0,0,0,0,0,0,0,0,0,0,0,0,0,0,0,0,0,0,0,0,0,0,0,0,0,0,0,0,0,0,0,0,0,0,0,0,0,0,0,0,0,0,0,0,0,0,0,0,0,0,0,0,0,0,0,0,0,0,0,0,{"$f":"JEY19","v":0},0,0,0,0,0,0,0,0,0,0,0,0,0,0,0,0,0,0,0,0,0,0,0,0,0,0,0,0,0,0,0,0,0,0,0,0,0,0,0,0,0,0,0,0,0,0,0,0,0,0,0,0,0,0,0,0,0,0,0,0,0,0,0,{"$f":"JHK19","v":0},0,0,0,0,0,0,0,0,0,0,0,0,0,0,0,0,0,0,0,0,0,0,0,0,0,0,0,0,0,0,0,0,0,0,0,0,0,0,0,0,0,0,0,0,0,0,0,0,0,0,0,0,0,0,0,0,0,0,0,0,0,0,0,{"$f":"JJW19","v":0},0,0,0,0,0,0,0,0,0,0,0,0,0,0,0,0,0,0,0,0,0,0,0,0,0,0,0,0,0,0,0,0,0,0,0,0,0,0,0,0,0,0,0,0,0,0,0,0,0,0,0,0,0,0,0,0,0,0,0,0,0,0,0,{"$f":"JMI19","v":0},0,0,0,0,0,0,0,0,0,0,0,0,0,0,0,0,0,0,0,0,0,0,0,0,0,0,0,0,0,0,0,0,0,0,0,0,0,0,0,0,0,0,0,0,0,0,0,0,0,0,0,0,0,0,0,0,0,0,0,0,0,0,0,{"$f":"JOU19","v":0},0,0,0,0,0,0,0,0,0,0,0,0,0,0,0,0,0,0,0,0,0,0,0,0,0,0,0,0,0,0,0,0,0,0,0,0,0,0,0,0,0,0,0,0,0,0,0,0,0,0,0,0,0,0,0,0,0,0,0,0,0,0,0,{"$f":"JRG19","v":0},0,0,0,0,0,0,0,0,0,0,0,0,0,0,0,0,0,0,0,0,0,0,0,0,0,0,0,0,0,0,0,0,0,0,0,0,0,0,0,0,0,0,0,0,0,0,0,0,0,0,0,0,0,0,0,0,0,0,0,0,0,0,0,{"$f":"JTS19","v":0},0,0,0,0,0,0,0,0,0,0,0,0,0,0,0,0,0,0,0,0,0,0,0,0,0,0,0,0,0,0,0,0,0,0,0,0,0,0,0,0,0,0,0,0,0,0,0,0,0,0,0,0,0,0,0,0,0,0,0,0,0,0,0,{"$f":"JWE19","v":0},0,0,0,0,0,0,0,0,0,0,0,0,0,0,0,0,0,0,0,0,0,0,0,0,0,0,0,0,0,0,0,0,0,0,0,0,0,0,0,0,0,0,0,0,0,0,0,0,0,0,0,0,0,0,0,0,0,0,0,0,0,0,0,{"$f":"JYQ19","v":0},0,0,0,0,0,0,0,0,0,0,0,0,0,0,0,0,0,0,0,0,0,0,0,0,0,0,0,0,0,0,0,0,0,0,0,0,0,0,0,0,0,0,0,0,0,0,0,0,0,0,0,0,0,0,0,0,0,0,0,0,0,0,0,{"$f":"KBC19","v":0},0,0,0,0,0,0,0,0,0,0,0,0,0,0,0,0,0,0,0,0,0,0,0,0,0,0,0,0,0,0,0,0,0,0,0,0,0,0,0,0,0,0,0,0,0,0,0,0,0,0,0,0,0,0,0,0,0,0,0,0,0,0,0,{"$f":"KDO19","v":0},0,0,0,0,0,0,0,0,0,0,0,0,0,0,0,0,0,0,0,0,0,0,0,0,0,0,0,0,0,0,0,0,0,0,0,0,0,0,0,0,0,0,0,0,0,0,0,0,0,0,0,0,0,0,0,0,0,0,0,0,0,0,0,{"$f":"KGA19","v":0},0,0,0,0,0,0,0,0,0,0,0,0,0,0,0,0,0,0,0,0,0,0,0,0,0,0,0,0,0,0,0,0,0,0,0,0,0,0,0,0,0,0,0,0,0,0,0,0,0,0,0,0,0,0,0,0,0,0,0,0,0,0,0,{"$f":"KIM19","v":0},0,0,0,0,0,0,0,0,0,0,0,0,0,0,0,0,0,0,0,0,0,0,0,0,0,0,0,0,0,0,0,0,0,0,0,0,0,0,0,0,0,0,0,0,0,0,0,0,0,0,0,0,0,0,0,0,0,0,0,0,0,0,0,{"$f":"KKY19","v":0},0,0,0,0,0,0,0,0,0,0,0,0,0,0,0,0,0,0,0,0,0,0,0,0,0,0,0,0,0,0,0,0,0,0,0,0,0,0,0,0,0,0,0,0,0,0,0,0,0,0,0,0,0,0,0,0,0,0,0,0,0,0,0,{"$f":"KNK19","v":0},0,0,0,0,0,0,0,0,0,0,0,0,0,0,0,0,0,0,0,0,0,0,0,0,0,0,0,0,0,0,0,0,0,0,0,0,0,0,0,0,0,0,0,0,0,0,0,0,0,0,0,0,0,0,0,0,0,0,0,0,0,0,0,{"$f":"KPW19","v":0},0,0,0,0,0,0,0,0,0,0,0,0,0,0,0,0,0,0,0,0,0,0,0,0,0,0,0,0,0,0,0,0,0,0,0,0,0,0,0,0,0,0,0,0,0,0,0,0,0,0,0,0,0,0,0,0,0,0,0,0,0,0,0,{"$f":"KSI19","v":0},0,0,0,0,0,0,0,0,0,0,0,0,0,0,0,0,0,0,0,0,0,0,0,0,0,0,0,0,0,0,0,0,0,0,0,0,0,0,0,0,0,0,0,0,0,0,0,0,0,0,0,0,0,0,0,0,0,0,0,0,0,0,0,{"$f":"KUU19","v":0},0,0,0,0,0,0,0,0,0,0,0,0,0,0,0,0,0,0,0,0,0,0,0,0,0,0,0,0,0,0,0,0,0,0,0,0,0,0,0,0,0,0,0,0,0,0,0,0,0,0,0,0,0,0,0,0,0,0,0,0,0,0,0,{"$f":"KXG19","v":0},0,0,0,0,0,0,0,0,0,0,0,0,0,0,0,0,0,0,0,0,0,0,0,0,0,0,0,0,0,0,0,0,0,0,0,0,0,0,0,0,0,0,0,0,0,0,0,0,0,0,0,0,0,0,0,0,0,0,0,0,0,0,0,{"$f":"KZS19","v":0},0,0,0,0,0,0,0,0,0,0,0,0,0,0,0,0,0,0,0,0,0,0,0,0,0,0,0,0,0,0,0,0,0,0,0,0,0,0,0,0,0,0,0,0,0,0,0,0,0,0,0,0,0,0,0,0,0,0,0,0,0,0,0,{"$f":"LCE19","v":0},0,0,0,0,0,0,0,0,0,0,0,0,0,0,0,0,0,0,0,0,0,0,0,0,0,0,0,0,0,0,0,0,0,0,0,0,0,0,0,0,0,0,0,0,0,0,0,0,0,0,0,0,0,0,0,0,0,0,0,0,0,0,0,{"$f":"LEQ19","v":0},0,0,0,0,0,0,0,0,0,0,0,0,0,0,0,0,0,0,0,0,0,0,0,0,0,0,0,0,0,0,0,0,0,0,0,0,0,0,0,0,0,0,0,0,0,0,0,0,0,0,0,0,0,0,0,0,0,0,0,0,0,0,0,{"$f":"LHC19","v":0},0,0,0,0,0,0,0,0,0,0,0,0,0,0,0,0,0,0,0,0,0,0,0,0,0,0,0,0,0,0,0,0,0,0,0,0,0,0,0,0,0,0,0,0,0,0,0,0,0,0,0,0,0,0,0,0,0,0,0,0,0,0,0,{"$f":"LJO19","v":0},0,0,0,0,0,0,0,0,0,0,0,0,0,0,0,0,0,0,0,0,0,0,0,0,0,0,0,0,0,0,0,0,0,0,0,0,0,0,0,0,0,0,0,0,0,0,0,0,0,0,0,0,0,0,0,0,0,0,0,0,0,0,0,{"$f":"LMA19","v":0},0,0,0,0,0,0,0,0,0,0,0,0,0,0,0,0,0,0,0,0,0,0,0,0,0,0,0,0,0,0,0,0,0,0,0,0,0,0,0,0,0,0,0,0,0,0,0,0,0,0,0,0,0,0,0,0,0,0,0,0,0,0,0,{"$f":"LOM19","v":0},0,0,0,0,0,0,0,0,0,0,0,0,0,0,0,0,0,0,0,0,0,0,0,0,0,0,0,0,0,0,0,0,0,0,0,0,0,0,0,0,0,0,0,0,0,0,0,0,0,0,0,0,0,0,0,0,0,0,0,0,0,0,0,{"$f":"LQY19","v":0},0,0,0,0,0,0,0,0,0,0,0,0,0,0,0,0,0,0,0,0,0,0,0,0,0,0,0,0,0,0,0,0,0,0,0,0,0,0,0,0,0,0,0,0,0,0,0,0,0,0,0,0,0,0,0,0,0,0,0,0,0,0,0,{"$f":"LTK19","v":0},0,0,0,0,0,0,0,0,0,0,0,0,0,0,0,0,0,0,0,0,0,0,0,0,0,0,0,0,0,0,0,0,0,0,0,0,0,0,0,0,0,0,0,0,0,0,0,0,0,0,0,0,0,0,0,0,0,0,0,0,0,0,0,{"$f":"LVW19","v":0},0,0,0,0,0,0,0,0,0,0,0,0,0,0,0,0,0,0,0,0,0,0,0,0,0,0,0,0,0,0,0,0,0,0,0,0,0,0,0,0,0,0,0,0,0,0,0,0,0,0,0,0,0,0,0,0,0,0,0,0,0,0,0,{"$f":"LYI19","v":0},0,0,0,0,0,0,0,0,0,0,0,0,0,0,0,0,0,0,0,0,0,0,0,0,0,0,0,0,0,0,0,0,0,0,0,0,0,0,0,0,0,0,0,0,0,0,0,0,0,0,0,0,0,0,0,0,0,0,0,0,0,0,0,{"$f":"MAU19","v":0},0,0,0,0,0,0,0,0,0,0,0,0,0,0,0,0,0,0,0,0,0,0,0,0,0,0,0,0,0,0,0,0,0,0,0,0,0,0,0,0,0,0,0,0,0,0,0,0,0,0,0,0,0,0,0,0,0,0,0,0,0,0,0,{"$f":"MDG19","v":0},0,0,0,0,0,0,0,0,0,0,0,0,0,0,0,0,0,0,0,0,0,0,0,0,0,0,0,0,0,0,0,0,0,0,0,0,0,0,0,0,0,0,0,0,0,0,0,0,0,0,0,0,0,0,0,0,0,0,0,0,0,0,0,{"$f":"MFS19","v":0},0,0,0,0,0,0,0,0,0,0,0,0,0,0,0,0,0,0,0,0,0,0,0,0,0,0,0,0,0,0,0,0,0,0,0,0,0,0,0,0,0,0,0,0,0,0,0,0,0,0,0,0,0,0,0,0,0,0,0,0,0,0,0,{"$f":"MIE19","v":0},0,0,0,0,0,0,0,0,0,0,0,0,0,0,0,0,0,0,0,0,0,0,0,0,0,0,0,0,0,0,0,0,0,0,0,0,0,0,0,0,0,0,0,0,0,0,0,0,0,0,0,0,0,0,0,0,0,0,0,0,0,0,0,{"$f":"MKQ19","v":0},0,0,0,0,0,0,0,0,0,0,0,0,0,0,0,0,0,0,0,0,0,0,0,0,0,0,0,0,0,0,0,0,0,0,0,0,0,0,0,0,0,0,0,0,0,0,0,0,0,0,0,0,0,0,0,0,0,0,0,0,0,0,0,{"$f":"MNC19","v":0},0,0,0,0,0,0,0,0,0,0,0,0,0,0,0,0,0,0,0,0,0,0,0,0,0,0,0,0,0,0,0,0,0,0,0,0,0,0,0,0,0,0,0,0,0,0,0,0,0,0,0,0,0,0,0,0,0,0,0,0,0,0,0,{"$f":"MPO19","v":0},0,0,0,0,0,0,0,0,0,0,0,0,0,0,0,0,0,0,0,0,0,0,0,0,0,0,0,0,0,0,0,0,0,0,0,0,0,0,0,0,0,0,0,0,0,0,0,0,0,0,0,0,0,0,0,0,0,0,0,0,0,0,0,{"$f":"MSA19","v":0},0,0,0,0,0,0,0,0,0,0,0,0,0,0,0,0,0,0,0,0,0,0,0,0,0,0,0,0,0,0,0,0,0,0,0,0,0,0,0,0,0,0,0,0,0,0,0,0,0,0,0,0,0,0,0,0,0,0,0,0,0,0,0,{"$f":"MUM19","v":0},0,0,0,0,0,0,0,0,0,0,0,0,0,0,0,0,0,0,0,0,0,0,0,0,0,0,0,0,0,0,0,0,0,0,0,0,0,0,0,0,0,0,0,0,0,0,0,0,0,0,0,0,0,0,0,0,0,0,0,0,0,0,0,{"$f":"MWY19","v":0},0,0,0,0,0,0,0,0,0,0,0,0,0,0,0,0,0,0,0,0,0,0,0,0,0,0,0,0,0,0,0,0,0,0,0,0,0,0,0,0,0,0,0,0,0,0,0,0,0,0,0,0,0,0,0,0,0,0,0,0,0,0,0,{"$f":"MZK19","v":0},0,0,0,0,0,0,0,0,0,0,0,0,0,0,0,0,0,0,0,0,0,0,0,0,0,0,0,0,0,0,0,0,0,0,0,0,0,0,0,0,0,0,0,0,0,0,0,0,0,0,0,0,0,0,0,0,0,0,0,0,0,0,0,{"$f":"NBW19","v":0},0,0,0,0,0,0,0,0,0,0,0,0,0,0,0,0,0,0,0,0,0,0,0,0,0,0,0,0,0,0,0,0,0,0,0,0,0,0,0,0,0,0,0,0,0,0,0,0,0,0,0,0,0,0,0,0,0,0,0,0,0,0,0,{"$f":"NEI19","v":0},0,0,0,0,0,0,0,0,0,0,0,0,0,0,0,0,0,0,0,0,0,0,0,0,0,0,0,0,0,0,0,0,0,0,0,0,0,0,0,0,0,0,0,0,0,0,0,0,0,0,0,0,0,0,0,0,0,0,0,0,0,0,0,{"$f":"NGU19","v":0},0,0,0,0,0,0,0,0,0,0,0,0,0,0,0,0,0,0,0,0,0,0,0,0,0,0,0,0,0,0,0,0,0,0,0,0,0,0,0,0,0,0,0,0,0,0,0,0,0,0,0,0,0,0,0,0,0,0,0,0,0,0,0,{"$f":"NJG19","v":0},0,0,0,0,0,0,0,0,0,0,0,0,0,0,0,0,0,0,0,0,0,0,0,0,0,0,0,0,0,0,0,0,0,0,0,0,0,0,0,0,0,0,0,0,0,0,0,0,0,0,0,0,0,0,0,0,0,0,0,0,0,0,0,{"$f":"NLS19","v":0},0,0,0,0,0,0,0,0,0,0,0,0,0,0,0,0,0,0,0,0,0,0,0,0,0,0,0,0,0,0,0,0,0,0,0,0,0,0,0,0,0,0,0,0,0,0,0,0,0,0,0,0,0,0,0,0,0,0,0,0,0,0,0,{"$f":"NOE19","v":0},0,0,0,0,0,0,0,0,0,0,0,0,0,0,0,0,0,0,0,0,0,0,0,0,0,0,0,0,0,0,0,0,0,0,0,0,0,0,0,0,0,0,0,0,0,0,0,0,0,0,0,0,0,0,0,0,0,0,0,0,0,0,0,{"$f":"NQQ19","v":0},0,0,0,0,0,0,0,0,0,0,0,0,0,0,0,0,0,0,0,0,0,0,0,0,0,0,0,0,0,0,0,0,0,0,0,0,0,0,0,0,0,0,0,0,0,0,0,0,0,0,0,0,0,0,0,0,0,0,0,0,0,0,0,{"$f":"NTC19","v":0},0,0,0,0,0,0,0,0,0,0,0,0,0,0,0,0,0,0,0,0,0,0,0,0,0,0,0,0,0,0,0,0,0,0,0,0,0,0,0,0,0,0,0,0,0,0,0,0,0,0,0,0,0,0,0,0,0,0,0,0,0,0,0,{"$f":"NVO19","v":0},0,0,0,0,0,0,0,0,0,0,0,0,0,0,0,0,0,0,0,0,0,0,0,0,0,0,0,0,0,0,0,0,0,0,0,0,0,0,0,0,0,0,0,0,0,0,0,0,0,0,0,0,0,0,0,0,0,0,0,0,0,0,0,{"$f":"NYA19","v":0},0,0,0,0,0,0,0,0,0,0,0,0,0,0,0,0,0,0,0,0,0,0,0,0,0,0,0,0,0,0,0,0,0,0,0,0,0,0,0,0,0,0,0,0,0,0,0,0,0,0,0,0,0,0,0,0,0,0,0,0,0,0,0,{"$f":"OAM19","v":0},0,0,0,0,0,0,0,0,0,0,0,0,0,0,0,0,0,0,0,0,0,0,0,0,0,0,0,0,0,0,0,0,0,0,0,0,0,0,0,0,0,0,0,0,0,0,0,0,0,0,0,0,0,0,0,0,0,0,0,0,0,0,0,{"$f":"OCY19","v":0},0,0,0,0,0,0,0,0,0,0,0,0,0,0,0,0,0,0,0,0,0,0,0,0,0,0,0,0,0,0,0,0,0,0,0,0,0,0,0,0,0,0,0,0,0,0,0,0,0,0,0,0,0,0,0,0,0,0,0,0,0,0,0,{"$f":"OFK19","v":0},0,0,0,0,0,0,0,0,0,0,0,0,0,0,0,0,0,0,0,0,0,0,0,0,0,0,0,0,0,0,0,0,0,0,0,0,0,0,0,0,0,0,0,0,0,0,0,0,0,0,0,0,0,0,0,0,0,0,0,0,0,0,0,{"$f":"OHW19","v":0},0,0,0,0,0,0,0,0,0,0,0,0,0,0,0,0,0,0,0,0,0,0,0,0,0,0,0,0,0,0,0,0,0,0,0,0,0,0,0,0,0,0,0,0,0,0,0,0,0,0,0,0,0,0,0,0,0,0,0,0,0,0,0,{"$f":"OKI19","v":0},0,0,0,0,0,0,0,0,0,0,0,0,0,0,0,0,0,0,0,0,0,0,0,0,0,0,0,0,0,0,0,0,0,0,0,0,0,0,0,0,0,0,0,0,0,0,0,0,0,0,0,0,0,0,0,0,0,0,0,0,0,0,0,{"$f":"OMU19","v":0},0,0,0,0,0,0,0,0,0,0,0,0,0,0,0,0,0,0,0,0,0,0,0,0,0,0,0,0,0,0,0,0,0,0,0,0,0,0,0,0,0,0,0,0,0,0,0,0,0,0,0,0,0,0,0,0,0,0,0,0,0,0,0,{"$f":"OPG19","v":0},0,0,0,0,0,0,0,0,0,0,0,0,0,0,0,0,0,0,0,0,0,0,0,0,0,0,0,0,0,0,0,0,0,0,0,0,0,0,0,0,0,0,0,0,0,0,0,0,0,0,0,0,0,0,0,0,0,0,0,0,0,0,0,{"$f":"ORS19","v":0},0,0,0,0,0,0,0,0,0,0,0,0,0,0,0,0,0,0,0,0,0,0,0,0,0,0,0,0,0,0,0,0,0,0,0,0,0,0,0,0,0,0,0,0,0,0,0,0,0,0,0,0,0,0,0,0,0,0,0,0,0,0,0,{"$f":"OUE19","v":0},0,0,0,0,0,0,0,0,0,0,0,0,0,0,0,0,0,0,0,0,0,0,0,0,0,0,0,0,0,0,0,0,0,0,0,0,0,0,0,0,0,0,0,0,0,0,0,0,0,0,0,0,0,0,0,0,0,0,0,0,0,0,0,{"$f":"OWQ19","v":0},0,0,0,0,0,0,0,0,0,0,0,0,0,0,0,0,0,0,0,0,0,0,0,0,0,0,0,0,0,0,0,0,0,0,0,0,0,0,0,0,0,0,0,0,0,0,0,0,0,0,0,0,0,0,0,0,0,0,0,0,0,0,0,{"$f":"OZC19","v":0},0,0,0,0,0,0,0,0,0,0,0,0,0,0,0,0,0,0,0,0,0,0,0,0,0,0,0,0,0,0,0,0,0,0,0,0,0,0,0,0,0,0,0,0,0,0,0,0,0,0,0,0,0,0,0,0,0,0,0,0,0,0,0,{"$f":"PBO19","v":0},0,0,0,0,0,0,0,0,0,0,0,0,0,0,0,0,0,0,0,0,0,0,0,0,0,0,0,0,0,0,0,0,0,0,0,0,0,0,0,0,0,0,0,0,0,0,0,0,0,0,0,0,0,0,0,0,0,0,0,0,0,0,0,{"$f":"PEA19","v":0},0,0,0,0,0,0,0,0,0,0,0,0,0,0,0,0,0,0,0,0,0,0,0,0,0,0,0,0,0,0,0,0,0,0,0,0,0,0,0,0,0,0,0,0,0,0,0,0,0,0,0,0,0,0,0,0,0,0,0,0,0,0,0,{"$f":"PGM19","v":0},0,0,0,0,0,0,0,0,0,0,0,0,0,0,0,0,0,0,0,0,0,0,0,0,0,0,0,0,0,0,0,0,0,0,0,0,0,0,0,0,0,0,0,0,0,0,0,0,0,0,0,0,0,0,0,0,0,0,0,0,0,0,0,{"$f":"PIY19","v":0},0,0,0,0,0,0,0,0,0,0,0,0,0,0,0,0,0,0,0,0,0,0,0,0,0,0,0,0,0,0,0,0,0,0,0,0,0,0,0,0,0,0,0,0,0,0,0,0,0,0,0,0,0,0,0,0,0,0,0,0,0,0,0,{"$f":"PLK19","v":0},0,0,0,0,0,0,0,0,0,0,0,0,0,0,0,0,0,0,0,0,0,0,0,0,0,0,0,0,0,0,0,0,0,0,0,0,0,0,0,0,0,0,0,0,0,0,0,0,0,0,0,0,0,0,0,0,0,0,0,0,0,0,0,{"$f":"PNW19","v":0},0,0,0,0,0,0,0,0,0,0,0,0,0,0,0,0,0,0,0,0,0,0,0,0,0,0,0,0,0,0,0,0,0,0,0,0,0,0,0,0,0,0,0,0,0,0,0,0,0,0,0,0,0,0,0,0,0,0,0,0,0,0,0,{"$f":"PQI19","v":0},0,0,0,0,0,0,0,0,0,0,0,0,0,0,0,0,0,0,0,0,0,0,0,0,0,0,0,0,0,0,0,0,0,0,0,0,0,0,0,0,0,0,0,0,0,0,0,0,0,0,0,0,0,0,0,0,0,0,0,0,0,0,0,{"$f":"PSU19","v":0},0,0,0,0,0,0,0,0,0,0,0,0,0,0,0,0,0,0,0,0,0,0,0,0,0,0,0,0,0,0,0,0,0,0,0,0,0,0,0,0,0,0,0,0,0,0,0,0,0,0,0,0,0,0,0,0,0,0,0,0,0,0,0,{"$f":"PVG19","v":0},0,0,0,0,0,0,0,0,0,0,0,0,0,0,0,0,0,0,0,0,0,0,0,0,0,0,0,0,0,0,0,0,0,0,0,0,0,0,0,0,0,0,0,0,0,0,0,0,0,0,0,0,0,0,0,0,0,0,0,0,0,0,0,{"$f":"PXS19","v":0},0,0,0,0,0,0,0,0,0,0,0,0,0,0,0,0,0,0,0,0,0,0,0,0,0,0,0,0,0,0,0,0,0,0,0,0,0,0,0,0,0,0,0,0,0,0,0,0,0,0,0,0,0,0,0,0,0,0,0,0,0,0,0,{"$f":"QAE19","v":0},0,0,0,0,0,0,0,0,0,0,0,0,0,0,0,0,0,0,0,0,0,0,0,0,0,0,0,0,0,0,0,0,0,0,0,0,0,0,0,0,0,0,0,0,0,0,0,0,0,0,0,0,0,0,0,0,0,0,0,0,0,0,0,{"$f":"QCQ19","v":0},0,0,0,0,0,0,0,0,0,0,0,0,0,0,0,0,0,0,0,0,0,0,0,0,0,0,0,0,0,0,0,0,0,0,0,0,0,0,0,0,0,0,0,0,0,0,0,0,0,0,0,0,0,0,0,0,0,0,0,0,0,0,0,{"$f":"QFC19","v":0},0,0,0,0,0,0,0,0,0,0,0,0,0,0,0,0,0,0,0,0,0,0,0,0,0,0,0,0,0,0,0,0,0,0,0,0,0,0,0,0,0,0,0,0,0,0,0,0,0,0,0,0,0,0,0,0,0,0,0,0,0,0,0,{"$f":"QHO19","v":0},0,0,0,0,0,0,0,0,0,0,0,0,0,0,0,0,0,0,0,0,0,0,0,0,0,0,0,0,0,0,0,0,0,0,0,0,0,0,0,0,0,0,0,0,0,0,0,0,0,0,0,0,0,0,0,0,0,0,0,0,0,0,0,{"$f":"QKA19","v":0},0,0,0,0,0,0,0,0,0,0,0,0,0,0,0,0,0,0,0,0,0,0,0,0,0,0,0,0,0,0,0,0,0,0,0,0,0,0,0,0,0,0,0,0,0,0,0,0,0,0,0,0,0,0,0,0,0,0,0,0,0,0,0,{"$f":"QMM19","v":0},0,0,0,0,0,0,0,0,0,0,0,0,0,0,0,0,0,0,0,0,0,0,0,0,0,0,0,0,0,0,0,0,0,0,0,0,0,0,0,0,0,0,0,0,0,0,0,0,0,0,0,0,0,0,0,0,0,0,0,0,0,0,0,{"$f":"QOY19","v":0},0,0,0,0,0,0,0,0,0,0,0,0,0,0,0,0,0,0,0,0,0,0,0,0,0,0,0,0,0,0,0,0,0,0,0,0,0,0,0,0,0,0,0,0,0,0,0,0,0,0,0,0,0,0,0,0,0,0,0,0,0,0,0,{"$f":"QRK19","v":0},0,0,0,0,0,0,0,0,0,0,0,0,0,0,0,0,0,0,0,0,0,0,0,0,0,0,0,0,0,0,0,0,0,0,0,0,0,0,0,0,0,0,0,0,0,0,0,0,0,0,0,0,0,0,0,0,0,0,0,0,0,0,0,{"$f":"QTW19","v":0},0,0,0,0,0,0,0,0,0,0,0,0,0,0,0,0,0,0,0,0,0,0,0,0,0,0,0,0,0,0,0,0,0,0,0,0,0,0,0,0,0,0,0,0,0,0,0,0,0,0,0,0,0,0,0,0,0,0,0,0,0,0,0,{"$f":"QWI19","v":0},0,0,0,0,0,0,0,0,0,0,0,0,0,0,0,0,0,0,0,0,0,0,0,0,0,0,0,0,0,0,0,0,0,0,0,0,0,0,0,0,0,0,0,0,0,0,0,0,0,0,0,0,0,0,0,0,0,0,0,0,0,0,0,{"$f":"QYU19","v":0},0,0,0,0,0,0,0,0,0,0,0,0,0,0,0,0,0,0,0,0,0,0,0,0,0,0,0,0,0,0,0,0,0,0,0,0,0,0,0,0,0,0,0,0,0,0,0,0,0,0,0,0,0,0,0,0,0,0,0,0,0,0,0,{"$f":"RBG19","v":0},0,0,0,0,0,0,0,0,0,0,0,0,0,0,0,0,0,0,0,0,0,0,0,0,0,0,0,0,0,0,0,0,0,0,0,0,0,0,0,0,0,0,0,0,0,0,0,0,0,0,0,0,0,0,0,0,0,0,0,0,0,0,0,{"$f":"RDS19","v":0},0,0,0,0,0,0,0,0,0,0,0,0,0,0,0,0,0,0,0,0,0,0,0,0,0,0,0,0,0,0,0,0,0,0,0,0,0,0,0,0,0,0,0,0,0,0,0,0,0,0,0,0,0,0,0,0,0,0,0,0,0,0,0,{"$f":"RGE19","v":0},0,0,0,0,0,0,0,0,0,0,0,0,0,0,0,0,0,0,0,0,0,0,0,0,0,0,0,0,0,0,0,0,0,0,0,0,0,0,0,0,0,0,0,0,0,0,0,0,0,0,0,0,0,0,0,0,0,0,0,0,0,0,0,{"$f":"RIQ19","v":0},0,0,0,0,0,0,0,0,0,0,0,0,0,0,0,0,0,0,0,0,0,0,0,0,0,0,0,0,0,0,0,0,0,0,0,0,0,0,0,0,0,0,0,0,0,0,0,0,0,0,0,0,0,0,0,0,0,0,0,0,0,0,0,{"$f":"RLC19","v":0},0,0,0,0,0,0,0,0,0,0,0,0,0,0,0,0,0,0,0,0,0,0,0,0,0,0,0,0,0,0,0,0,0,0,0,0,0,0,0,0,0,0,0,0,0,0,0,0,0,0,0,0,0,0,0,0,0,0,0,0,0,0,0,{"$f":"RNO19","v":0},0,0,0,0,0,0,0,0,0,0,0,0,0,0,0,0,0,0,0,0,0,0,0,0,0,0,0,0,0,0,0,0,0,0,0,0,0,0,0,0,0,0,0,0,0,0,0,0,0,0,0,0,0,0,0,0,0,0,0,0,0,0,0,{"$f":"RQA19","v":0},0,0,0,0,0,0,0,0,0,0,0,0,0,0,0,0,0,0,0,0,0,0,0,0,0,0,0,0,0,0,0,0,0,0,0,0,0,0,0,0,0,0,0,0,0,0,0,0,0,0,0,0,0,0,0,0,0,0,0,0,0,0,0,{"$f":"RSM19","v":0},0,0,0,0,0,0,0,0,0,0,0,0,0,0,0,0,0,0,0,0,0,0,0,0,0,0,0,0,0,0,0,0,0,0,0,0,0,0,0,0,0,0,0,0,0,0,0,0,0,0,0,0,0,0,0,0,0,0,0,0,0,0,0,{"$f":"RUY19","v":0},0,0,0,0,0,0,0,0,0,0,0,0,0,0,0,0,0,0,0,0,0,0,0,0,0,0,0,0,0,0,0,0,0,0,0,0,0,0,0,0,0,0,0,0,0,0,0,0,0,0,0,0,0,0,0,0,0,0,0,0,0,0,0,{"$f":"RXK19","v":0},0,0,0,0,0,0,0,0,0,0,0,0,0,0,0,0,0,0,0,0,0,0,0,0,0,0,0,0,0,0,0,0,0,0,0,0,0,0,0,0,0,0,0,0,0,0,0,0,0,0,0,0,0,0,0,0,0,0,0,0,0,0,0,{"$f":"RZW19","v":0},0,0,0,0,0,0,0,0,0,0,0,0,0,0,0,0,0,0,0,0,0,0,0,0,0,0,0,0,0,0,0,0,0,0,0,0,0,0,0,0,0,0,0,0,0,0,0,0,0,0,0,0,0,0,0,0,0,0,0,0,0,0,0,{"$f":"SCI19","v":0},0,0,0,0,0,0,0,0,0,0,0,0,0,0,0,0,0,0,0,0,0,0,0,0,0,0,0,0,0,0,0,0,0,0,0,0,0,0,0,0,0,0,0,0,0,0,0,0,0,0,0,0,0,0,0,0,0,0,0,0,0,0,0,{"$f":"SEU19","v":0},0,0,0,0,0,0,0,0,0,0,0,0,0,0,0,0,0,0,0,0,0,0,0,0,0,0,0,0,0,0,0,0,0,0,0,0,0,0,0,0,0,0,0,0,0,0,0,0,0,0,0,0,0,0,0,0,0,0,0,0,0,0,0,{"$f":"SHG19","v":0},0,0,0,0,0,0,0,0,0,0,0,0,0,0,0,0,0,0,0,0,0,0,0,0,0,0,0,0,0,0,0,0,0,0,0,0,0,0,0,0,0,0,0,0,0,0,0,0,0,0,0,0,0,0,0,0,0,0,0,0,0,0,0,{"$f":"SJS19","v":0},0,0,0,0,0,0,0,0,0,0,0,0,0,0,0,0,0,0,0,0,0,0,0,0,0,0,0,0,0,0,0,0,0,0,0,0,0,0,0,0,0,0,0,0,0,0,0,0,0,0,0,0,0,0,0,0,0,0,0,0,0,0,0,{"$f":"SME19","v":0},0,0,0,0,0,0,0,0,0,0,0,0,0,0,0,0,0,0,0,0,0,0,0,0,0,0,0,0,0,0,0,0,0,0,0,0,0,0,0,0,0,0,0,0,0,0,0,0,0,0,0,0,0,0,0,0,0,0,0,0,0,0,0,{"$f":"SOQ19","v":0},0,0,0,0,0,0,0,0,0,0,0,0,0,0,0,0,0,0,0,0,0,0,0,0,0,0,0,0,0,0,0,0,0,0,0,0,0,0,0,0,0,0,0,0,0,0,0,0,0,0,0,0,0,0,0,0,0,0,0,0,0,0,0,{"$f":"SRC19","v":0},0,0,0,0,0,0,0,0,0,0,0,0,0,0,0,0,0,0,0,0,0,0,0,0,0,0,0,0,0,0,0,0,0,0,0,0,0,0,0,0,0,0,0,0,0,0,0,0,0,0,0,0,0,0,0,0,0,0,0,0,0,0,0,{"$f":"STO19","v":0},0,0,0,0,0,0,0,0,0,0,0,0,0,0,0,0,0,0,0,0,0,0,0,0,0,0,0,0,0,0,0,0,0,0,0,0,0,0,0,0,0,0,0,0,0,0,0,0,0,0,0,0,0,0,0,0,0,0,0,0,0,0,0,{"$f":"SWA19","v":0},0,0,0,0,0,0,0,0,0,0,0,0,0,0,0,0,0,0,0,0,0,0,0,0,0,0,0,0,0,0,0,0,0,0,0,0,0,0,0,0,0,0,0,0,0,0,0,0,0,0,0,0,0,0,0,0,0,0,0,0,0,0,0,{"$f":"SYM19","v":0},0,0,0,0,0,0,0,0,0,0,0,0,0,0,0,0,0,0,0,0,0,0,0,0,0,0,0,0,0,0,0,0,0,0,0,0,0,0,0,0,0,0,0,0,0,0,0,0,0,0,0,0,0,0,0,0,0,0,0,0,0,0,0,{"$f":"TAY19","v":0},0,0,0,0,0,0,0,0,0,0,0,0,0,0,0,0,0,0,0,0,0,0,0,0,0,0,0,0,0,0,0,0,0,0,0,0,0,0,0,0,0,0,0,0,0,0,0,0,0,0,0,0,0,0,0,0,0,0,0,0,0,0,0,{"$f":"TDK19","v":0},0,0,0,0,0,0,0,0,0,0,0,0,0,0,0,0,0,0,0,0,0,0,0,0,0,0,0,0,0,0,0,0,0,0,0,0,0,0,0,0,0,0,0,0,0,0,0,0,0,0,0,0,0,0,0,0,0,0,0,0,0,0,0,{"$f":"TFW19","v":0},0,0,0,0,0,0,0,0,0,0,0,0,0,0,0,0,0,0,0,0,0,0,0,0,0,0,0,0,0,0,0,0,0,0,0,0,0,0,0,0,0,0,0,0,0,0,0,0,0,0,0,0,0,0,0,0,0,0,0,0,0,0,0,{"$f":"TII19","v":0},0,0,0,0,0,0,0,0,0,0,0,0,0,0,0,0,0,0,0,0,0,0,0,0,0,0,0,0,0,0,0,0,0,0,0,0,0,0,0,0,0,0,0,0,0,0,0,0,0,0,0,0,0,0,0,0,0,0,0,0,0,0,0,{"$f":"TKU19","v":0},0,0,0,0,0,0,0,0,0,0,0,0,0,0,0,0,0,0,0,0,0,0,0,0,0,0,0,0,0,0,0,0,0,0,0,0,0,0,0,0,0,0,0,0,0,0,0,0,0,0,0,0,0,0,0,0,0,0,0,0,0,0,0,{"$f":"TNG19","v":0},0,0,0,0,0,0,0,0,0,0,0,0,0,0,0,0,0,0,0,0,0,0,0,0,0,0,0,0,0,0,0,0,0,0,0,0,0,0,0,0,0,0,0,0,0,0,0,0,0,0,0,0,0,0,0,0,0,0,0,0,0,0,0,{"$f":"TPS19","v":0},0,0,0,0,0,0,0,0,0,0,0,0,0,0,0,0,0,0,0,0,0,0,0,0,0,0,0,0,0,0,0,0,0,0,0,0,0,0,0,0,0,0,0,0,0,0,0,0,0,0,0,0,0,0,0,0,0,0,0,0,0,0,0,{"$f":"TSE19","v":0},0,0,0,0,0,0,0,0,0,0,0,0,0,0,0,0,0,0,0,0,0,0,0,0,0,0,0,0,0,0,0,0,0,0,0,0,0,0,0,0,0,0,0,0,0,0,0,0,0,0,0,0,0,0,0,0,0,0,0,0,0,0,0,{"$f":"TUQ19","v":0},0,0,0,0,0,0,0,0,0,0,0,0,0,0,0,0,0,0,0,0,0,0,0,0,0,0,0,0,0,0,0,0,0,0,0,0,0,0,0,0,0,0,0,0,0,0,0,0,0,0,0,0,0,0,0,0,0,0,0,0,0,0,0,{"$f":"TXC19","v":0},0,0,0,0,0,0,0,0,0,0,0,0,0,0,0,0,0,0,0,0,0,0,0,0,0,0,0,0,0,0,0,0,0,0,0,0,0,0,0,0,0,0,0,0,0,0,0,0,0,0,0,0,0,0,0,0,0,0,0,0,0,0,0,{"$f":"TZO19","v":0},0,0,0,0,0,0,0,0,0,0,0,0,0,0,0,0,0,0,0,0,0,0,0,0,0,0,0,0,0,0,0,0,0,0,0,0,0,0,0,0,0,0,0,0,0,0,0,0,0,0,0,0,0,0,0,0,0,0,0,0,0,0,0,{"$f":"UCA19","v":0},0,0,0,0,0,0,0,0,0,0,0,0,0,0,0,0,0,0,0,0,0,0,0,0,0,0,0,0,0,0,0,0,0,0,0,0,0,0,0,0,0,0,0,0,0,0,0,0,0,0,0,0,0,0,0,0,0,0,0,0,0,0,0,{"$f":"UEM19","v":0},0,0,0,0,0,0,0,0,0,0,0,0,0,0,0,0,0,0,0,0,0,0,0,0,0,0,0,0,0,0,0,0,0,0,0,0,0,0,0,0,0,0,0,0,0,0,0,0,0,0,0,0,0,0,0,0,0,0,0,0,0,0,0,{"$f":"UGY19","v":0},0,0,0,0,0,0,0,0,0,0,0,0,0,0,0,0,0,0,0,0,0,0,0,0,0,0,0,0,0,0,0,0,0,0,0,0,0,0,0,0,0,0,0,0,0,0,0,0,0,0,0,0,0,0,0,0,0,0,0,0,0,0,0,{"$f":"UJK19","v":0},0,0,0,0,0,0,0,0,0,0,0,0,0,0,0,0,0,0,0,0,0,0,0,0,0,0,0,0,0,0,0,0,0,0,0,0,0,0,0,0,0,0,0,0,0,0,0,0,0,0,0,0,0,0,0,0,0,0,0,0,0,0,0,{"$f":"ULW19","v":0},0,0,0,0,0,0,0,0,0,0,0,0,0,0,0,0,0,0,0,0,0,0,0,0,0,0,0,0,0,0,0,0,0,0,0,0,0,0,0,0,0,0,0,0,0,0,0,0,0,0,0,0,0,0,0,0,0,0,0,0,0,0,0,{"$f":"UOI19","v":0},0,0,0,0,0,0,0,0,0,0,0,0,0,0,0,0,0,0,0,0,0,0,0,0,0,0,0,0,0,0,0,0,0,0,0,0,0,0,0,0,0,0,0,0,0,0,0,0,0,0,0,0,0,0,0,0,0,0,0,0,0,0,0,{"$f":"UQU19","v":0},0,0,0,0,0,0,0,0,0,0,0,0,0,0,0,0,0,0,0,0,0,0,0,0,0,0,0,0,0,0,0,0,0,0,0,0,0,0,0,0,0,0,0,0,0,0,0,0,0,0,0,0,0,0,0,0,0,0,0,0,0,0,0,{"$f":"UTG19","v":0},0,0,0,0,0,0,0,0,0,0,0,0,0,0,0,0,0,0,0,0,0,0,0,0,0,0,0,0,0,0,0,0,0,0,0,0,0,0,0,0,0,0,0,0,0,0,0,0,0,0,0,0,0,0,0,0,0,0,0,0,0,0,0,{"$f":"UVS19","v":0},0,0,0,0,0,0,0,0,0,0,0,0,0,0,0,0,0,0,0,0,0,0,0,0,0,0,0,0,0,0,0,0,0,0,0,0,0,0,0,0,0,0,0,0,0,0,0,0,0,0,0,0,0,0,0,0,0,0,0,0,0,0,0,{"$f":"UYE19","v":0},0,0,0,0,0,0,0,0,0,0,0,0,0,0,0,0,0,0,0,0,0,0,0,0,0,0,0,0,0,0,0,0,0,0,0,0,0,0,0,0,0,0,0,0,0,0,0,0,0,0,0,0,0,0,0,0,0,0,0,0,0,0,0,{"$f":"VAQ19","v":0},0,0,0,0,0,0,0,0,0,0,0,0,0,0,0,0,0,0,0,0,0,0,0,0,0,0,0,0,0,0,0,0,0,0,0,0,0,0,0,0,0,0,0,0,0,0,0,0,0,0,0,0,0,0,0,0,0,0,0,0,0,0,0,{"$f":"VDC19","v":0},0,0,0,0,0,0,0,0,0,0,0,0,0,0,0,0,0,0,0,0,0,0,0,0,0,0,0,0,0,0,0,0,0,0,0,0,0,0,0,0,0,0,0,0,0,0,0,0,0,0,0,0,0,0,0,0,0,0,0,0,0,0,0,{"$f":"VFO19","v":0},0,0,0,0,0,0,0,0,0,0,0,0,0,0,0,0,0,0,0,0,0,0,0,0,0,0,0,0,0,0,0,0,0,0,0,0,0,0,0,0,0,0,0,0,0,0,0,0,0,0,0,0,0,0,0,0,0,0,0,0,0,0,0,{"$f":"VIA19","v":0},0,0,0,0,0,0,0,0,0,0,0,0,0,0,0,0,0,0,0,0,0,0,0,0,0,0,0,0,0,0,0,0,0,0,0,0,0,0,0,0,0,0,0,0,0,0,0,0,0,0,0,0,0,0,0,0,0,0,0,0,0,0,0,{"$f":"VKM19","v":0},0,0,0,0,0,0,0,0,0,0,0,0,0,0,0,0,0,0,0,0,0,0,0,0,0,0,0,0,0,0,0,0,0,0,0,0,0,0,0,0,0,0,0,0,0,0,0,0,0,0,0,0,0,0,0,0,0,0,0,0,0,0,0,{"$f":"VMY19","v":0},0,0,0,0,0,0,0,0,0,0,0,0,0,0,0,0,0,0,0,0,0,0,0,0,0,0,0,0,0,0,0,0,0,0,0,0,0,0,0,0,0,0,0,0,0,0,0,0,0,0,0,0,0,0,0,0,0,0,0,0,0,0,0,{"$f":"VPK19","v":0},0,0,0,0,0,0,0,0,0,0,0,0,0,0,0,0,0,0,0,0,0,0,0,0,0,0,0,0,0,0,0,0,0,0,0,0,0,0,0,0,0,0,0,0,0,0,0,0,0,0,0,0,0,0,0,0,0,0,0,0,0,0,0,{"$f":"VRW19","v":0},0,0,0,0,0,0,0,0,0,0,0,0,0,0,0,0,0,0,0,0,0,0,0,0,0,0,0,0,0,0,0,0,0,0,0,0,0,0,0,0,0,0,0,0,0,0,0,0,0,0,0,0,0,0,0,0,0,0,0,0,0,0,0,{"$f":"VUI19","v":0},0,0,0,0,0,0,0,0,0,0,0,0,0,0,0,0,0,0,0,0,0,0,0,0,0,0,0,0,0,0,0,0,0,0,0,0,0,0,0,0,0,0,0,0,0,0,0,0,0,0,0,0,0,0,0,0,0,0,0,0,0,0,0,{"$f":"VWU19","v":0},0,0,0,0,0,0,0,0,0,0,0,0,0,0,0,0,0,0,0,0,0,0,0,0,0,0,0,0,0,0,0,0,0,0,0,0,0,0,0,0,0,0,0,0,0,0,0,0,0,0,0,0,0,0,0,0,0,0,0,0,0,0,0,{"$f":"VZG19","v":0},0,0,0,0,0,0,0,0,0,0,0,0,0,0,0,0,0,0,0,0,0,0,0,0,0,0,0,0,0,0,0,0,0,0,0,0,0,0,0,0,0,0,0,0,0,0,0,0,0,0,0,0,0,0,0,0,0,0,0,0,0,0,0,{"$f":"WBS19","v":0},0,0,0,0,0,0,0,0,0,0,0,0,0,0,0,0,0,0,0,0,0,0,0,0,0,0,0,0,0,0,0,0,0,0,0,0,0,0,0,0,0,0,0,0,0,0,0,0,0,0,0,0,0,0,0,0,0,0,0,0,0,0,0,{"$f":"WEE19","v":0},0,0,0,0,0,0,0,0,0,0,0,0,0,0,0,0,0,0,0,0,0,0,0,0,0,0,0,0,0,0,0,0,0,0,0,0,0,0,0,0,0,0,0,0,0,0,0,0,0,0,0,0,0,0,0,0,0,0,0,0,0,0,0,{"$f":"WGQ19","v":0},0,0,0,0,0,0,0,0,0,0,0,0,0,0,0,0,0,0,0,0,0,0,0,0,0,0,0,0,0,0,0,0,0,0,0,0,0,0,0,0,0,0,0,0,0,0,0,0,0,0,0,0,0,0,0,0,0,0,0,0,0,0,0,{"$f":"WJC19","v":0},0,0,0,0,0,0,0,0,0,0,0,0,0,0,0,0,0,0,0,0,0,0,0,0,0,0,0,0,0,0,0,0,0,0,0,0,0,0,0,0,0,0,0,0,0,0,0,0,0,0,0,0,0,0,0,0,0,0,0,0,0,0,0,{"$f":"WLO19","v":0},0,0,0,0,0,0,0,0,0,0,0,0,0,0,0,0,0,0,0,0,0,0,0,0,0,0,0,0,0,0,0,0,0,0,0,0,0,0,0,0,0,0,0,0,0,0,0,0,0,0,0,0,0,0,0,0,0,0,0,0,0,0,0,{"$f":"WOA19","v":0},0,0,0,0,0,0,0,0,0,0,0,0,0,0,0,0,0,0,0,0,0,0,0,0,0,0,0,0,0,0,0,0,0,0,0,0,0,0,0,0,0,0,0,0,0,0,0,0,0,0,0,0,0,0,0,0,0,0,0,0,0,0,0,{"$f":"WQM19","v":0},0,0,0,0,0,0,0,0,0,0,0,0,0,0,0,0,0,0,0,0,0,0,0,0,0,0,0,0,0,0,0,0,0,0,0,0,0,0,0,0,0,0,0,0,0,0,0,0,0,0,0,0,0,0,0,0,0,0,0,0,0,0,0,{"$f":"WSY19","v":0},0,0,0,0,0,0,0,0,0,0,0,0,0,0,0,0,0,0,0,0,0,0,0,0,0,0,0,0,0,0,0,0,0,0,0,0,0,0,0,0,0,0,0,0,0,0,0,0,0,0,0,0,0,0,0,0,0,0,0,0,0,0,0,{"$f":"WVK19","v":0},0,0,0,0,0,0,0,0,0,0,0,0,0,0,0,0,0,0,0,0,0,0,0,0,0,0,0,0,0,0,0,0,0,0,0,0,0,0,0,0,0,0,0,0,0,0,0,0,0,0,0,0,0,0,0,0,0,0,0,0,0,0,0,{"$f":"WXW19","v":0},0,0,0,0,0,0,0,0,0,0,0,0,0,0,0,0,0,0,0,0,0,0,0,0,0,0,0,0,0,0,0,0,0,0,0,0,0,0,0,0,0,0,0,0,0,0,0,0,0,0,0,0,0,0,0,0,0,0,0,0,0,0,0,{"$f":"XAI19","v":0},0,0,0,0,0,0,0,0,0,0,0,0,0,0,0,0,0,0,0,0,0,0,0,0,0,0,0,0,0,0,0,0,0,0,0,0,0,0,0,0,0,0,0,0,0,0,0,0,0,0,0,0,0,0,0,0,0,0,0,0,0,0,0,{"$f":"XCU19","v":0},0,0,0,0,0,0,0,0,0,0,0,0,0,0,0,0,0,0,0,0,0,0,0,0,0,0,0,0,0,0,0,0,0,0,0,0,0,0,0,0,0,0,0,0,0,0,0,0,0,0,0,0,0,0,0,0,0,0,0,0,0]

{"sheet":"db_kruh","index":7,"n_rows":128,"n_cols":34,"rows_kept":128,"cut":false,"hidden":true,"merged":[]}
[null,null,1,2,3,4,5,6,7,8,9,10,11,12,13,14,15,16,17,18,19,20,21,22,23,24,25,26,27,28,29,30,31,32]
[null,null,null,16,20,25,31.5,40,50,63,80,100,125,160,200,250,315,400,500,630,800,1000,1250,1600,2000,2500,3150,4000,5000,6300,8000,10000,12500,16000]
["výběr",null,null,{"$f":"VLOOKUP($D$10,$C$24:$AH$128,D1)","v":0},2.8541999999999987,3.4326999999999992,8.0004000000000008,3.5942000000000003,0.9756999999999999,2,0,0,2,2.2235999999999989,4.8969000000000014,1.4673000000000025,6.7759999999999989,7.4133999999999975,16.2606,34.192,40.0107,47.011900000000004,48.372799999999998,41.656800000000004,41.784300000000002,41.030999999999999,36.461800000000004,34.2363,28.513500000000001,27.382899999999999,18.5883,19.419899999999998,21.517599999999998,12.9534]
["násobek pro jádro",null,null,null,null,null,null,null,null,{"$f":"VLOOKUP($B$7,$A$13:$I$21,2)","v":{"$error":"#N/A"}},null,null,{"$f":"VLOOKUP($B$7,$A$13:$I$21,3)","v":{"$error":"#N/A"}},null,null,{"$f":"VLOOKUP($B$7,$A$13:$I$21,4)","v":{"$error":"#N/A"}},null,null,{"$f":"VLOOKUP($B$7,$A$13:$I$21,5)","v":{"$error":"#N/A"}},null,null,{"$f":"VLOOKUP($B$7,$A$13:$I$21,6)","v":{"$error":"#N/A"}},null,null,{"$f":"VLOOKUP($B$7,$A$13:$I$21,7)","v":{"$error":"#N/A"}},null,null,{"$f":"VLOOKUP($B$7,$A$13:$I$21,8)","v":{"$error":"#N/A"}},null,null,{"$f":"VLOOKUP($B$7,$A$13:$I$21,9)","v":{"$error":"#N/A"}}]
["přen. útl.",null,null,{"$f":"IF($F$7=1,D3*D4,D3)","v":0},{"$f":"IF($F$7=1,E3*E4,E3)","v":2.8541999999999987},3.4326999999999992,8.0004000000000008,3.5942000000000003,0.9756999999999999,2,0,0,2,2.2235999999999989,4.8969000000000014,1.4673000000000025,6.7759999999999989,7.4133999999999975,16.2606,34.192,40.0107,47.011900000000004,48.372799999999998,41.656800000000004,41.784300000000002,41.030999999999999,36.461800000000004,34.2363,28.513500000000001,27.382899999999999,18.5883,19.419899999999998,21.517599999999998,12.9534]
[]
["průměr",{"$f":"zadání!D32","v":140},{"$f":"B7/1000","v":0.14000000000000001},null,"jádro",{"$f":"zadání!K34","v":0},null,null,null,"průt. plocha",{"$f":"IF(F7=1,PI()*POWER(C7/2,2)-PI()*POWER(C7/4,2),PI()*POWER(C7/2,2))","v":1.5393804002589988E-2},null,null,"příčný rozměr",{"$f":"IF(F7=1,SQRT(3*POWER(C7,2)/16),C7)","v":0.14000000000000001},"m",null,"čelní plocha",{"$f":"PI()*POWER(C7/2,2)","v":1.5393804002589988E-2},"m2"]
["izolace",{"$f":"HLOOKUP(B7,D8:X9,2)","v":50},null,80,100,110,125,140,150,160,180,200,225,250,280,315,355,400,450,500,560,630,710,800]
[null,null,null,50,50,50,50,50,50,50,50,50,50,50,50,50,100,100,100,100,100,100,100,100]
["délka",{"$f":"zadání!L32","v":900},{"$f":"B10/1000","v":0.9},{"$f":"B7+HLOOKUP(B10,E10:I11,2)","v":141},600,900,1200,1500,2000]
[null,null,null,null,0,1,2,3,4]
["jádro"]
[null,63,125,250,500,1000,2000,4000,8000]
[355,0.71249999999999991,0.75493430758638758,1.2445439914271179,0.92213080845381534,2.6692789182514138,1.9233458224102049,1.7220701736736896,2.4260999105610606]
[400,0.72499999999999998,0.78994369221690364,1.2381255155397435,0.93024248768982121,2.6798506717843527,2.0230115478831174,1.8224276636471892,2.482613149659409]
[450,0.75,0.85996246147793576,1.2252885637649948,0.94646584616183305,2.7009941788502303,2.2223429988289425,2.0231426435941886,2.595639627856106]
[500,0.8,1,1.1996146602154978,0.97891256310585661,2.7432811929819856,2.6210059007205926,2.4245726034881874,2.8216925842495004]
[560,0.9,1.2800750770441285,1.1482668531165037,1.0438059969939038,2.8278552212454962,3.4183317045038932,3.2274325232761845,3.2737984970362888]
[630,1,1.5601501540882567,1.0969190460175096,1.1086994308819507,2.9124292495090067,4.2156575082871939,4.0302924430641811,3.7259044098230776]
[710,1.05,1.7001876926103208,1.0712451424680125,1.1411461478259741,2.954716263640762,4.614320410178844,4.4317224029581794,3.951957366216472]
[800,1.0750000000000002,1.7702064618713527,1.0584081906932639,1.1573695062979859,2.9758597707066397,4.8136518611246686,4.632437382905179,4.0649838444131694]
[]
[]
[80,600,80,0,0,5.4200000000000017,10.135000000000002,6.419999999999999,3.6924999999999977,0,0,0,1,3.725000000000005,6.399999999999995,1.4750000000000019,7.6749999999999954,7.402500000000007,16.877500000000012,31.940000000000005,42.987500000000011,49.155000000000015,51.44,52.03,44.085000000000001,44.75,47.647499999999994,39.689999999999991,31.627500000000015,26.319999999999993,26.412500000000001,26.637500000000003,27.732500000000002,15.745000000000001]
[null,900,81,0,0.91000000000000281,3.8725000000000009,8.8725000000000023,1.9824999999999973,4.18,7.1249999999999991,2.5,0,2,10.680000000000005,13.49,8.9024999999999928,15.004999999999999,22.825000000000006,28.790000000000003,41.932500000000005,52.925000000000011,54.59,53.930000000000007,56.64,47.057499999999997,48.760000000000005,49.462499999999991,47.025000000000006,45.7,37.684999999999988,33.094999999999999,37.522500000000008,31.282499999999995,15.927500000000002]
[null,1200,82,0,1.7290000000000059,0,7.2295000000000034,0,0,8.75,4.7499999999999973,0,4,16.753249999999998,19.551000000000002,15.513499999999986,21.218249999999998,36.335124999999991,38.667374999999986,49.328749999999985,59.719375000000007,57.023749999999978,52.64500000000001,57.366249999999994,47.34375,50.131500000000017,48.713624999999979,51.641999999999996,50.248249999999999,46.597499999999982,37.788624999999996,45.987124999999992,33.090874999999997,15.304500000000001]
[null,1500,83,0,2.4570000000000083,0,5.7127500000000033,0,0,10,6.7499999999999973,0,5,22.131,24.903000000000006,21.381749999999979,26.698500000000003,48.302999999999983,47.353499999999983,55.725749999999998,60.833750000000002,58.91399999999998,53,57.337499999999991,47.248750000000001,51.102000000000025,47.783249999999981,52.970500000000001,57.360500000000002,54.373499999999993,41.814,53.363250000000001,34.544249999999998,14.663250000000001]
[null,2000,84,0,3.6096666666666786,0,3.6068333333333378,0,0,11.25,9.9166666666666607,0,5,30.754416666666657,33.56366666666667,30.716166666666634,35.59941666666667,67.46804166666665,61.598791666666628,63.274249999999995,61.839166666666671,61.359124999999992,52.75,59.268749999999997,48.426249999999996,53.943833333333359,47.699874999999984,55.25,58.357416666666666,64.982749999999996,48.957875000000001,59.358208333333337,37.654291666666651,14.107166666666666]
[100,600,100,2.740000000000002,0,6.1000000000000005,9.9200000000000017,6.5699999999999985,4.0999999999999979,0,0,0,1,2.980000000000004,5.1199999999999957,1.1800000000000015,6.8299999999999965,6.4900000000000055,15.79000000000001,31.380000000000003,41.13000000000001,47.990000000000009,51.92,50.22,43.28,43.53,45.22,37.099999999999994,29.690000000000012,26.199999999999996,24.060000000000002,24.26,25.520000000000003,15.230000000000002]
[null,900,101,0,1.5800000000000018,3.3100000000000005,8.6400000000000023,2.1899999999999977,3.5199999999999996,5.6999999999999993,2,0,1,9.0600000000000041,11.71,7.5599999999999952,13.61,20.140000000000004,26.560000000000002,40.49,50.290000000000006,52.980000000000004,53.600000000000009,53.58,45.89,47.960000000000008,47.69,45.120000000000005,42.860000000000007,36.209999999999994,30.490000000000002,34.230000000000004,29.479999999999997,15.400000000000002]
[null,1200,102,0,3.0020000000000033,0,6.9920000000000027,0,0,7,3.799999999999998,0,4,14.382999999999997,17.385000000000002,13.24299999999999,19.370499999999996,32.10049999999999,35.463499999999989,47.11999999999999,56.477500000000006,55.071499999999986,52.516000000000012,54.092999999999996,46.074999999999996,49.770500000000013,47.651999999999987,50.482999999999997,48,43.908999999999985,35.073999999999998,41.989999999999995,31.767999999999997,14.791500000000001]
[null,1500,103,0,4.2660000000000045,0,5.4720000000000031,0,0,8,5.3999999999999977,0,4,19.097999999999999,22.401000000000007,18.287999999999986,24.453000000000003,42.695999999999984,43.289999999999985,52.838999999999999,58,56.663999999999987,53,54.269999999999996,45.999000000000002,51.138000000000019,47.36699999999999,53,55,50.606999999999992,39.015000000000001,48.753,33.659999999999997,14.166000000000002]
[null,2000,104,0,6.2673333333333394,0,3.3546666666666702,0,0,9,7.9333333333333291,0,5,26.650333333333325,30.492333333333338,26.310333333333311,32.6995,59.661499999999982,56.14249999999997,60,60,59,53,56.014999999999993,47.140999999999998,54.572833333333357,48.234666666666655,56,58,60,45.956666666666671,55,37.399999999999984,13.619833333333332]
[110,600,110,0,0,7.4599999999999991,9.490000000000002,6.8699999999999974,4.9149999999999983,0,0,0,1,1.490000000000002,2.5599999999999978,0.59000000000000075,5.14,4.6650000000000018,13.615000000000006,30.259999999999998,37.415000000000006,45.660000000000004,52.88,46.6,41.67,41.09,40.365000000000002,31.92,25.815000000000005,25.959999999999997,19.355,19.505000000000003,21.095000000000002,14.200000000000003]
[null,900,111,0,2.92,2.1849999999999996,8.1750000000000007,2.6049999999999986,2.1999999999999993,2.8499999999999996,1,0,1,5.8200000000000012,8.1500000000000021,4.875,10.82,14.770000000000001,22.1,37.605000000000004,45.02,49.760000000000005,52.940000000000005,47.46,43.555000000000007,46.360000000000007,44.145000000000003,41.31,37.180000000000007,33.26,25.28,27.645000000000003,25.875,14.345000000000002]
[null,1200,112,0,5.5479999999999983,0,6.5170000000000012,0,0,3.5,1.899999999999999,0,2,9.6424999999999947,13.053000000000004,8.7019999999999982,15.674999999999997,23.631249999999994,29.055749999999993,42.702499999999993,49.993750000000006,51.167000000000002,52.25800000000001,47.546499999999995,43.537499999999994,49.048500000000004,45.528750000000002,48.164999999999992,43.503500000000003,38.531999999999989,29.644749999999998,33.995749999999994,29.122249999999994,13.765499999999999]
[null,1500,113,0,7.8839999999999968,0,4.9905000000000017,0,0,4,2.6999999999999988,0,4,13.031999999999996,17.397000000000006,12.100499999999998,19.962,31.481999999999992,35.162999999999997,47.0655,52.332499999999996,52.164000000000001,53,48.134999999999998,43.499499999999998,51.210000000000008,46.534500000000001,53.058999999999997,50.279000000000003,43.073999999999998,33.417000000000002,39.532499999999999,31.891499999999994,13.171500000000002]
[null,2000,114,0,11.582666666666661,0,2.8503333333333352,0,0,4.5,3.9666666666666646,0,4,18.442166666666658,24.349666666666675,17.498666666666665,26.899666666666661,44.048416666666654,45.229916666666654,53.45150000000001,56.321666666666658,54.281750000000017,53.5,49.507499999999993,44.570499999999996,55.830833333333345,49.304249999999996,57.5,57.285166666666669,50.034500000000001,39.954250000000002,46.283583333333326,36.891416666666657,12.645166666666665]
[125,600,125,0,0,8.8199999999999967,9.06,7.1699999999999964,5.7299999999999986,0,0,0,1,0,0,2,3.4500000000000028,2.8399999999999981,11.44,29.139999999999993,33.700000000000003,43.33,53.84,42.980000000000004,40.06,38.650000000000006,35.510000000000005,26.740000000000006,21.939999999999998,25.72,14.649999999999999,14.750000000000002,16.670000000000002,13.170000000000002]
[null,900,126,0,4.259999999999998,1.0599999999999987,7.7100000000000009,3.0199999999999996,0.87999999999999901,1,0,0,1,2.5799999999999983,4.5900000000000034,2.1900000000000039,8.0300000000000011,9.3999999999999986,17.64,34.72,39.75,46.540000000000006,52.28,41.34,41.220000000000006,44.760000000000005,40.600000000000009,37.5,31.5,30.31,20.07,21.060000000000002,22.27,13.290000000000001]
[null,1200,127,0,8.0939999999999941,0,6.0419999999999998,0,0,2,0,0,2,4.9019999999999939,8.7210000000000054,4.1610000000000076,11.979499999999998,15.162000000000001,22.647999999999996,38.284999999999997,43.51,47.26250000000001,52,41,41,48.326500000000003,43.405500000000011,45.846999999999994,39.006999999999998,33.154999999999994,24.215499999999999,26.001499999999997,26.476499999999994,12.7395]
[null,1500,128,0,11.50199999999999,0,4.5090000000000003,0,0,2,0,0,2,6.9659999999999931,12.393000000000006,5.9130000000000118,15.470999999999998,20.268000000000001,27.036000000000001,41.292000000000009,46.664999999999999,47.664000000000023,53,42,41,51.282000000000004,45.702000000000012,53.117999999999995,45.558000000000007,35.540999999999997,27.818999999999999,30.311999999999994,30.122999999999994,12.177]
[null,2000,129,0,16.897999999999982,0,2.3459999999999996,0,0,3,0,0,4,10.233999999999989,18.207000000000011,8.6870000000000154,21.099833333333326,28.435333333333332,34.31733333333333,46.903000000000013,52.643333333333324,49.563500000000026,54,43,42,57.088833333333326,50.373833333333344,59,56.570333333333338,40.069000000000003,33.951833333333326,37.567166666666658,36.382833333333323,11.670499999999997]
[140,600,140,0,0,7.4174999999999978,9.8025000000000002,7.4966999999999979,6.4956000000000005,1,0,0,1,0,0.48509999999999909,0,2.3115000000000019,1.9027999999999987,10.011099999999999,27.882699999999996,32.884900000000002,43.6633,49.487300000000005,41.2607,37.2682,34.023400000000002,30.484100000000002,25.509100000000004,19.7257,22.849,14.616999999999997,14.3573,16.8614,12.84]
[null,900,141,0,2.8541999999999987,3.4326999999999992,8.0004000000000008,3.5942000000000003,0.9756999999999999,2,0,0,2,2.2235999999999989,4.8969000000000014,1.4673000000000025,6.7759999999999989,7.4133999999999975,16.2606,34.192,40.0107,47.011900000000004,48.372799999999998,41.656800000000004,41.784300000000002,41.030999999999999,36.461800000000004,34.2363,28.513500000000001,27.382899999999999,18.5883,19.419899999999998,21.517599999999998,12.9534]
[null,1200,142,0,5.4229799999999955,0,5.8883850000000004,0,0,2,0,0,2,4.2248399999999959,8.8432650000000006,2.7878700000000052,10.678474999999995,12.277799999999997,21.384594999999997,38.476234999999996,44.779674999999997,47.842475,48.7,42.151204999999997,44.480509999999995,45.636669999999995,40.317525000000003,40.815324999999994,35.436234999999996,30.320959999999996,21.431619999999999,23.258374999999997,24.865109999999994,12.413460000000001]
[null,1500,143,0,7.7063399999999938,0,3.9565800000000002,0,0,2,0,0,3,6.0037199999999951,12.348450000000001,3.9617100000000081,14.134499999999994,16.591139999999996,25.88364,42.129540000000006,48.836069999999999,48.338190000000012,49.7,43.393920000000001,45.62,49.541579999999996,43.575480000000006,46.521630000000002,41.480190000000007,32.805630000000001,23.87781,26.590589999999995,27.746999999999993,11.86218]
[null,2000,144,0,11.321659999999987,0,1.5718199999999998,0,0,2,0,0,4,8.8202799999999932,17.912475000000004,5.8202900000000106,19.673958333333321,23.476093333333324,33.299118333333332,48.727185000000006,55.071033333333325,50.396585000000009,50.7,45.334254999999999,47.94,56.716703333333321,49.623028333333345,52.005704999999999,51.625118333333333,37.406120000000001,28.177273333333329,32.285351666666656,32.801783333333326,11.363819999999999]
[150,600,150,0,0,6.0149999999999988,10.545,7.8233999999999986,7.2612000000000023,1,0,0,1,0,0.97019999999999817,0,1.1730000000000009,0.96559999999999935,8.5822000000000003,26.625400000000003,32.069800000000001,43.996600000000001,45.134599999999999,39.541399999999996,34.476399999999998,29.396799999999999,25.458199999999998,24.278200000000002,17.511400000000002,19.978000000000002,14.583999999999998,13.964599999999997,17.052799999999998,12.51]
[null,900,151,0,1.448399999999999,5.8053999999999997,8.2908000000000008,4.168400000000001,1.0714000000000008,2,0,0,2,1.8671999999999995,5.2037999999999984,0.74460000000000126,5.5219999999999967,5.4267999999999965,14.8812,33.664000000000001,40.2714,47.483800000000002,44.465599999999995,41.973599999999998,42.348599999999998,37.302,32.323599999999999,30.9726,25.527000000000001,24.455800000000004,17.1066,17.779799999999998,20.765199999999997,12.6168]
[null,1200,152,0,2.7519599999999977,0,5.734770000000001,0,0,2,0,0,2,3.5476799999999979,8.965529999999994,1.4147400000000023,9.3774499999999925,9.3935999999999957,20.121189999999999,38.667469999999994,46.049349999999997,48.422449999999998,45.4,43.302409999999995,47.961019999999991,42.946839999999995,37.229550000000003,35.783649999999994,31.865469999999995,27.486920000000001,18.647739999999999,20.515249999999995,23.253719999999994,12.08742]
[null,1500,153,0,3.9106799999999966,0,3.4041600000000001,0,0,2,0,0,3,5.041439999999997,12.303899999999997,2.0104200000000039,12.797999999999991,12.914279999999991,24.731280000000002,42.96708000000001,51.00714,49.01238,46.4,44.787840000000003,50.24,47.801159999999996,41.448960000000007,39.925260000000002,37.402380000000001,30.070260000000001,19.936620000000001,22.869179999999997,25.370999999999995,11.547360000000001]
[null,2000,154,0,5.7453199999999942,0,0.7976399999999999,0,0,2,0,0,4,7.4065599999999954,17.617949999999993,2.953580000000005,18.248083333333316,18.516853333333319,32.280903333333335,50.551369999999999,57.498733333333334,51.229669999999992,47.4,47.668509999999998,53.88,56.344573333333322,48.872223333333345,45.011409999999998,46.679903333333328,34.74324,22.402713333333331,27.003536666666662,29.220733333333321,11.05714]
[160,600,160,0,0,4.57,11.31,8.16,8.0500000000000043,1,0,0,1,0,1.4699999999999971,1,0,0,7.1100000000000012,25.330000000000005,31.23,44.34,40.65,37.769999999999996,31.599999999999991,24.629999999999995,20.279999999999994,23.009999999999998,15.230000000000004,17.020000000000003,14.549999999999997,13.559999999999995,17.249999999999996,12.169999999999998]
[null,900,161,0,0,8.25,8.59,4.7600000000000016,1.1700000000000017,2,0,0,2,1.5,5.519999999999996,1,4.2299999999999951,3.3799999999999955,13.46,33.120000000000005,40.54,47.97,40.44,42.3,42.929999999999993,33.459999999999994,28.059999999999995,27.61,22.450000000000003,21.440000000000005,15.579999999999998,16.089999999999996,19.989999999999995,12.27]
[null,1200,162,0,0,0,5.5765000000000011,0,0,2,0,0,2,2.8499999999999996,9.0914999999999893,2,8.0369999999999884,6.4219999999999908,18.819500000000001,38.864499999999992,47.357499999999995,49.019999999999989,42,44.488499999999995,51.546999999999983,40.175499999999985,34.047999999999995,30.599499999999992,28.186499999999995,24.567000000000004,15.779499999999999,17.688999999999997,21.593499999999992,11.7515]
[null,1500,163,0,0,0,2.8350000000000004,0,0,2,0,0,3,4.0499999999999989,12.257999999999992,4,11.420999999999987,9.125999999999987,23.544,43.830000000000005,53.244,49.706999999999994,43,46.224000000000004,55,46.007999999999988,39.258000000000003,33.129000000000005,33.201000000000001,27.252000000000002,15.876000000000001,19.035,22.922999999999995,11.223000000000003]
[null,2000,164,0,0,0,0,0,0,2,0,0,4,5.9499999999999993,17.314499999999985,5,16.778999999999979,13.407333333333314,31.231833333333338,52.430833333333325,60,52.087999999999973,44,50.073499999999996,60,55.961166666666649,48.098666666666674,37.805166666666665,41.584833333333329,31.999666666666666,16.453166666666668,21.561666666666664,25.531166666666657,10.74116666666667]
[180,600,180,0,3.3149999999999995,5.44,8.9700000000000006,6.0600000000000005,5.2750000000000021,2.3300000000000018,0,1.3449999999999989,1.2050000000000016,0.69999999999999929,3.1549999999999967,5.41,5.6450000000000031,7.6350000000000051,14.025000000000002,25.154999999999998,29.305,37.655000000000001,35.714999999999996,32.42,30.484999999999999,27.634999999999998,23.049999999999997,22.674999999999997,21.180000000000003,19.465,18.424999999999997,14.36,17.474999999999998,14.040000000000001]
[null,900,181,0,3.2999999999999989,5.7750000000000004,6.6400000000000006,3.7200000000000006,0.96000000000000085,0.47500000000000231,0,1.5399999999999991,0.98499999999999932,0.87000000000000122,5.5549999999999962,6.0499999999999972,9.0450000000000017,10.510000000000002,18.765000000000004,31.344999999999999,37.61,41.075000000000003,41.964999999999989,42.43,40.65,34.574999999999996,29.274999999999999,28.209999999999997,25.335000000000001,22.655000000000001,20.774999999999999,17.599999999999998,20.9,14.47]
[null,1200,182,0,3.1207499999999984,0.13775000000000043,4.0945000000000018,0.66499999999999893,0,0,0,1.6482499999999993,0.72674999999999723,1.4249999999999998,7.5572499999999927,6.3554999999999939,11.822749999999997,12.715749999999996,22.329750000000004,35.658249999999995,43.619249999999994,42.270249999999997,45.5,49.817999999999991,48.274249999999981,39.439249999999987,33.724999999999994,32.057749999999992,28.015499999999992,24.55275,21.96875,19.797999999999995,23.108749999999993,14.155000000000001]
[null,1500,183,0,2.9429999999999983,0,1.7820000000000014,5.3999999999998452E-2,0,0,0,1.7369999999999999,0.49049999999999533,2.0249999999999995,9.3194999999999943,6.5969999999999924,14.260499999999997,14.633999999999995,25.420500000000004,39.352500000000006,48.798000000000009,43.1235,48,51.612000000000002,52.866499999999995,43.60949999999999,37.552500000000002,35.352000000000004,30.280499999999996,26.131499999999999,22.927500000000002,21.671999999999997,24.974999999999994,13.797000000000002]
[null,2000,184,0,2.7582499999999972,0,0,0,0,0,0,1.91675,0.15158333333332569,2.9749999999999996,12.20174999999999,7.1371666666666558,18.28491666666666,17.893916666666655,30.723250000000007,45.935416666666669,56.114833333333337,45.572749999999985,51,55.036749999999998,58.5,51.018416666666653,44.285000000000004,41.229249999999993,34.48449999999999,29.198916666666662,24.982916666666668,25.057999999999993,28.439583333333324,13.63966666666667]
[200,600,200,0,6.629999999999999,6.3100000000000005,6.63,3.9600000000000004,2.5000000000000004,4.6600000000000037,0,2.6899999999999977,2.4100000000000033,1.3999999999999986,4.8399999999999963,10.82,11.290000000000006,15.27000000000001,20.940000000000005,24.97999999999999,27.380000000000003,30.970000000000006,30.779999999999994,27.070000000000007,29.370000000000005,30.64,25.82,22.339999999999996,27.130000000000003,21.909999999999997,22.299999999999997,15.160000000000004,17.7,15.910000000000004]
[null,900,201,0,6.5999999999999979,3.3000000000000007,4.6900000000000004,2.6799999999999993,0.75,0.95000000000000462,0,3.0799999999999983,1.9699999999999986,0.24000000000000243,5.5899999999999963,12.099999999999994,13.860000000000007,17.640000000000008,24.070000000000007,29.569999999999993,34.680000000000007,34.180000000000007,43.489999999999988,42.56,38.370000000000005,35.69,30.490000000000002,28.809999999999995,28.22,23.869999999999994,25.97,19.11,21.81,16.670000000000002]
[null,1200,202,0,6.2414999999999967,0.27550000000000086,2.6125000000000016,1.3299999999999979,0,1,0,3.2964999999999987,1.4534999999999945,0,6.0229999999999961,12.710999999999988,15.608500000000006,19.009500000000003,25.840000000000003,32.451999999999998,39.881,35.520500000000006,49,55.147499999999987,45.001499999999986,38.702999999999996,33.401999999999994,33.515999999999991,27.844499999999989,24.538499999999996,28.157999999999998,21.906999999999993,24.623999999999995,16.558500000000002]
[null,1500,203,0,5.8859999999999966,0,0.72900000000000209,0.1079999999999969,0,1,0,3.4739999999999998,0.98099999999999066,0,6.3809999999999967,13.193999999999985,17.100000000000009,20.142000000000003,27.297000000000004,34.875,44.352000000000018,36.540000000000006,53,57,50.73299999999999,41.210999999999991,35.847000000000001,37.574999999999996,27.359999999999989,25.010999999999996,29.979000000000003,24.308999999999994,27.026999999999994,16.371000000000002]
[null,2000,204,0,5.5164999999999944,0,0,0,0,1,0,3.8334999999999999,0.30316666666665137,0,7.0889999999999969,14.274333333333312,19.790833333333339,22.380499999999998,30.214666666666673,39.440000000000005,52.229666666666681,39.057500000000005,58,60,57,46.075666666666649,40.471333333333334,44.653333333333322,27.384166666666648,26.398166666666661,33.512666666666668,28.554333333333322,31.347999999999995,16.538166666666669]
[225,600,225,0,3.3149999999999995,3.5900000000000003,5.3049999999999997,3.1300000000000003,1.2500000000000002,4.9050000000000047,0,2.0650000000000013,1.210000000000004,1.915,4.0599999999999987,7.9400000000000013,9.3500000000000014,12.435000000000002,17.835000000000001,21.989999999999995,28.09,36.145000000000003,31.459999999999997,25.355,26.385000000000002,26.83,22.195000000000004,19.574999999999996,22.405000000000005,19.274999999999999,18.934999999999999,13.070000000000004,14.55,12.955000000000002]
[null,900,226,0,3.2999999999999989,1.6500000000000004,4.42,3.4149999999999991,2.1950000000000003,1.6400000000000041,0.82499999999999929,3.1999999999999993,1.5500000000000007,3.760000000000002,5.3599999999999994,9.8149999999999977,12.100000000000001,15.595000000000002,22.090000000000003,27.999999999999996,35.215000000000003,39.835000000000001,42.875,37.364999999999995,33.78,30.56,26.895000000000003,23.959999999999997,24.240000000000002,21.684999999999995,21.935000000000002,16.955000000000002,17.984999999999999,14.23]
[null,1200,227,0,3.1207499999999984,0.13775000000000043,3.3582500000000013,3.5149999999999966,3.4579999999999997,1,1.5674999999999981,4.1182499999999971,1.7954999999999965,4.5,6.327,11.105499999999992,14.107500000000002,17.817250000000001,25.027750000000005,32.3095,40.222999999999999,41.348749999999995,49.380499999999998,46.906249999999986,39.116249999999994,32.575499999999998,30.015249999999995,26.927749999999996,24.771249999999995,22.890249999999995,23.688250000000004,19.797999999999995,20.348999999999997,14.729749999999999]
[null,1500,228,0,2.9429999999999983,0,2.3850000000000025,3.586499999999996,4.9140000000000006,1,2.2274999999999983,4.9229999999999956,2.0069999999999943,4.75,7.1640000000000015,12.20849999999999,15.840000000000003,19.723500000000001,27.540000000000006,36.018000000000001,44.518500000000017,42.493499999999997,52,50.653499999999994,43.712999999999994,34.218000000000004,32.665500000000002,29.457000000000001,25.118999999999996,23.854499999999998,25.141500000000008,22.252499999999998,22.369499999999999,15.102]
[null,2000,229,0,2.7582499999999972,0,2.0286666666666675,4.6466666666666621,7.219333333333334,1,3.2724999999999964,6.2574166666666589,2.3771666666666555,5,8.6076666666666686,14.186499999999985,18.855833333333333,23.104416666666665,32.037916666666675,42.531166666666664,52.13900000000001,45.360249999999994,56.5,56.964833333333331,49.928499999999993,37.601166666666664,37.509083333333329,34.032583333333335,26.323083333333322,25.943416666666664,27.99475000000001,26.519999999999992,25.992999999999999,16.06925]
[250,600,250,0,0,0.86999999999999988,3.9800000000000004,2.3000000000000003,0,5.1500000000000048,0,1.4400000000000048,1.0000000000004672E-2,2.4300000000000015,3.2800000000000011,5.0600000000000032,7.4099999999999975,9.5999999999999943,14.729999999999997,19,28.799999999999997,41.32,32.14,23.639999999999993,23.4,23.019999999999996,18.570000000000007,16.809999999999995,17.680000000000007,16.64,15.57,10.980000000000004,11.400000000000002,10.000000000000002]
[null,900,251,0,0,0,4.1500000000000004,4.1499999999999986,3.6400000000000006,2.3300000000000036,1.6499999999999986,3.3200000000000003,1.1300000000000026,7.2800000000000011,5.1300000000000026,7.5300000000000011,10.339999999999996,13.549999999999997,20.11,26.43,35.75,45.489999999999995,42.260000000000005,32.169999999999995,29.189999999999998,25.43,23.300000000000004,19.11,20.260000000000005,19.5,17.900000000000006,14.800000000000004,14.160000000000004,11.790000000000001]
[null,1200,252,0,0,0,4.104000000000001,5.6999999999999957,6.9159999999999995,0,3.1349999999999962,4.9399999999999951,2.1374999999999988,9,6.6310000000000029,9.4999999999999982,12.606499999999995,16.624999999999996,24.215500000000002,32.166999999999994,40.564999999999998,47.176999999999992,49.760999999999996,38.664999999999985,33.230999999999995,26.448,26.628499999999995,20.339500000000001,21.698000000000004,21.241999999999997,19.218500000000009,17.689,16.074000000000002,12.900999999999998]
[null,1500,253,0,0,0,4.0410000000000021,7.0649999999999951,9.8280000000000012,0,4.4549999999999965,6.371999999999991,3.0329999999999977,9.5,7.9470000000000054,11.222999999999995,14.579999999999997,19.304999999999996,27.783000000000005,37.160999999999994,44.685000000000009,48.446999999999989,51,44.306999999999995,36.692999999999998,27.225000000000009,29.483999999999998,21.339000000000009,22.878000000000004,22.698,20.304000000000016,20.195999999999998,17.712000000000003,13.833]
[null,2000,254,0,0,0,4.057333333333335,9.2933333333333241,14.438666666666668,0,6.5449999999999928,8.6813333333333187,4.4511666666666603,10,10.12633333333334,14.098666666666659,17.920833333333327,23.82833333333333,33.861166666666676,45.62233333333333,52.048333333333332,51.662999999999982,55,53.929666666666655,42.856999999999985,29.126666666666676,34.546833333333325,23.411833333333345,25.261999999999997,25.488666666666663,22.476833333333353,24.485666666666663,20.638000000000002,15.600333333333332]
[280,600,280,0,1.504999999999999,2.33,4.55,2.0849999999999986,0,6.2600000000000016,0,0.72000000000000242,0.57500000000000262,2.3500000000000023,1.9500000000000002,4.4550000000000036,6.634999999999998,9.3999999999999986,13.489999999999998,18.164999999999999,28.75,37.25,30.445,22.754999999999992,19.59,19.404999999999994,15.275000000000006,14.914999999999999,15.525000000000006,14.61,15.04,10.96,11.66,10.875]
[null,900,281,0,0,2.31,4.78,2.58,1.8200000000000003,4.6650000000000018,0.82499999999999929,2.2900000000000027,1.5850000000000009,5.5650000000000013,5.8049999999999997,9.16,10.834999999999997,14.175000000000001,18.73,22.6,27.29,31.949999999999996,28.49,22.454999999999998,22.004999999999995,15.685000000000004,16.869999999999997,14.414999999999999,13.234999999999999,14.3,12.280000000000006,11.440000000000005,11.705000000000002,9.2899999999999991]
[null,1200,282,0,0,2.5887499999999997,4.759500000000001,2.9212500000000006,3.4579999999999997,3.55,1.5674999999999981,3.6670000000000016,2.4652499999999984,7.07925,7.8155000000000019,10.25,14.283249999999995,17.3125,22.7715,27.583499999999997,32.282499999999999,36.088499999999996,36.380499999999998,29.332499999999992,24.615499999999997,21.224,20.814249999999998,15.669750000000001,15.349000000000002,14.620999999999999,13.859250000000005,13.3445,13.537000000000001,10.450499999999998]
[null,1500,283,0,0,2.8260000000000001,4.716000000000002,3.5324999999999975,4.9140000000000006,3.6,2.2274999999999983,4.8870000000000022,3.2444999999999968,7.9044999999999987,10.973500000000003,14.111499999999998,16.79,20.152499999999996,26.289000000000001,31.080499999999997,35.842500000000001,38.223499999999994,38,33.153499999999994,27.346499999999999,22.112500000000004,22.241999999999997,16.669500000000006,16.439,16.349,15.902000000000008,15.597999999999999,14.856000000000002,11.416499999999999]
[null,2000,284,0,0,3.2569166666666667,4.7798333333333352,4.6466666666666621,7.219333333333334,3.65,3.2724999999999964,6.8396666666666688,4.4950833333333264,9.0984166666666653,14.063166666666671,18.04933333333333,20.960416666666664,25.914166666666667,32.251833333333337,38.311166666666665,42.524166666666666,42.831499999999991,42.5,40.464833333333331,32.928499999999993,25.06333333333334,27.273416666666662,19.705916666666674,18.631,18.24433333333333,17.488416666666676,18.24283333333333,16.819000000000003,12.800166666666666]
[315,600,315,0,3.009999999999998,3.79,5.1199999999999992,1.8699999999999972,0,7.3699999999999974,0,0,1.1400000000000006,2.2700000000000031,0.61999999999999922,3.8500000000000032,5.8599999999999994,9.2000000000000028,12.250000000000002,17.329999999999998,28.7,33.18,28.749999999999996,21.86999999999999,15.780000000000001,15.789999999999996,11.980000000000004,13.020000000000003,13.370000000000006,12.58,14.509999999999998,10.939999999999998,11.919999999999998,11.749999999999998]
[null,900,316,0,0,4.62,5.41,1.0100000000000016,0,7,0,1.2600000000000051,2.0399999999999991,3.8500000000000019,6.4799999999999969,10.79,11.33,14.800000000000002,17.350000000000001,18.770000000000003,18.829999999999998,18.409999999999997,14.719999999999992,12.739999999999998,14.819999999999993,5.9400000000000084,10.439999999999991,9.7200000000000006,6.2099999999999937,9.1000000000000032,6.6600000000000072,8.0800000000000054,9.25,6.7899999999999991]
[null,1200,317,0,0,5.1774999999999993,5.4150000000000009,0.1425000000000054,0,7.1,0,2.3940000000000081,2.7929999999999975,5.1584999999999992,9,11,15.959999999999997,18,21.327499999999997,23,24,25,23,20,16,16,15,11,9,8,8.5,9,11,8]
[null,1500,318,0,0,5.6520000000000001,5.3910000000000018,0,0,7.2,0,3.4020000000000126,3.4559999999999964,6.3089999999999984,14,17,19,21,24.794999999999998,25,27,28,25,22,18,17,15,12,10,10,11.5,11,12,9]
[null,2000,319,0,0,6.5138333333333334,5.5023333333333353,0,0,7.3,0,4.9980000000000189,4.5389999999999935,8.1968333333333288,18,22,24,28,30.642499999999998,31,33,34,30,27,23,21,20,16,12,11,12.5,12,13,10]
[355,600,355,0,1.504999999999999,4.2050000000000001,5.2650000000000006,1.4399999999999995,0,6.8649999999999967,0,0.63000000000000256,1.5899999999999999,3.0600000000000023,3.5499999999999976,7.32,8.5949999999999989,12.000000000000002,14.8,18.05,23.765000000000001,25.795000000000002,21.734999999999992,17.304999999999996,15.299999999999997,10.865,11.209999999999997,11.370000000000001,9.7899999999999991,10.84,10.585000000000001,9.5100000000000016,10.584999999999999,9.27]
[null,900,356,0,2.1300000000000008,3.9699999999999998,4.3900000000000006,0.50500000000000078,0,6.2799999999999994,0,1.4400000000000048,2.3550000000000004,4.7950000000000017,8.1149999999999984,12.905000000000001,14.344999999999999,19.055000000000003,22.89,23.475000000000001,22.225000000000001,21.875,17.854999999999993,15.425000000000002,17.299999999999994,7.6550000000000065,11.90499999999999,10.309999999999999,7.4449999999999967,10.120000000000001,7.7000000000000046,8.0500000000000043,9.25,7.6849999999999996]
[null,1200,357,0,4.0470000000000006,3.548249999999999,3.3392500000000012,7.12500000000027E-2,0,5.8109999999999999,0,2.137500000000006,2.9640000000000004,6.2035,10.6845,14.643750000000001,19.090249999999997,24.1145,29.43099999999999,29.355249999999995,27.394750000000002,27.828249999999997,24.448499999999996,21.153000000000002,19.751499999999997,14.080000000000002,15.242499999999996,11.238,9.7962500000000023,10.260499999999997,9.3895,8.2810000000000006,9.8937500000000007,8.925749999999999]
[null,1500,358,0,5.7509999999999994,3.1499999999999995,2.6955000000000009,0,0,5.3820000000000023,0,2.7540000000000076,3.4965000000000011,7.4385000000000012,14.330500000000004,19.066000000000006,22.739000000000001,28.648499999999999,35.162999999999997,33.649999999999991,31.140000000000008,31.64,27.588500000000003,23.982500000000002,22.364999999999998,15.803500000000003,16.153499999999994,11.966999999999999,11.129000000000005,11.848999999999998,11.555,9.0549999999999997,10.162500000000001,9.9719999999999995]
[null,2000,359,0,8.4490000000000016,3.2569166666666667,2.7511666666666676,0,0,4.7663333333333373,0,3.7485000000000106,4.386000000000001,9.4831666666666656,18.239500000000003,23.975250000000006,28.774749999999997,37.168166666666664,44.670333333333332,42.140416666666653,37.969583333333347,38.568749999999994,33.691500000000005,29.565000000000005,27.635833333333334,19.827333333333335,20.248166666666663,14.471333333333332,13.538083333333342,13.413499999999997,13.205833333333331,9.3149999999999977,10.43125,11.435916666666664]
[400,600,400,0,0,4.6199999999999992,5.410000000000001,1.0100000000000016,0,6.3599999999999959,0,1.2600000000000051,2.0399999999999991,3.850000000000001,6.479999999999996,10.789999999999997,11.329999999999998,14.8,17.350000000000001,18.770000000000003,18.829999999999998,18.410000000000004,14.719999999999992,12.740000000000004,14.819999999999993,5.9400000000000039,10.439999999999991,9.7199999999999989,6.2099999999999937,9.1000000000000014,6.6600000000000037,8.0800000000000054,9.25,6.7900000000000009]
[null,900,401,0,4.2600000000000016,3.3199999999999994,3.370000000000001,0,0,5.5599999999999987,0,1.6200000000000045,2.6700000000000017,5.740000000000002,9.75,15.020000000000003,17.36,23.310000000000002,28.430000000000003,28.18,25.620000000000005,25.340000000000003,20.989999999999995,18.110000000000007,19.779999999999994,9.3700000000000045,13.36999999999999,10.899999999999999,8.68,11.14,8.740000000000002,8.0200000000000031,9.25,8.58]
[null,1200,402,0,8.0940000000000012,1.9189999999999987,1.2635000000000016,0,0,4.5220000000000011,0,1.8810000000000038,3.1350000000000029,7.2485000000000008,12.369000000000002,18.287500000000001,22.220500000000001,30.228999999999996,37.534499999999987,35.710499999999989,30.789500000000007,30.656499999999994,25.896999999999995,22.306000000000004,23.502999999999993,12.160000000000002,15.484999999999991,11.475999999999997,10.592500000000005,12.520999999999995,10.279,7.5620000000000003,8.7874999999999996,9.8514999999999979]
[null,1500,403,0,11.501999999999999,0.64799999999999902,0,0,0,3.5640000000000049,0,2.106000000000003,3.5370000000000053,8.5680000000000032,14.661000000000007,21.132000000000012,26.478000000000002,36.296999999999997,45.530999999999992,42.29999999999999,35.280000000000015,35.28,30.177000000000003,25.965000000000007,26.729999999999997,14.607000000000005,17.306999999999992,11.933999999999999,12.258000000000012,13.697999999999997,11.61,7.1099999999999985,8.3250000000000011,10.943999999999999]
[null,2000,404,0,16.898000000000003,0,0,0,0,2.2326666666666752,0,2.4990000000000019,4.2330000000000085,10.769500000000003,18.479000000000006,25.950500000000012,33.549499999999995,46.336333333333336,58.698166666666658,53.280833333333312,42.939166666666686,43.137499999999996,37.383000000000003,32.13000000000001,32.271666666666668,18.654666666666667,20.496333333333325,12.942666666666664,15.076166666666683,15.826999999999995,13.91166666666666,6.6299999999999955,7.8624999999999998,12.871833333333329]
[450,600,450,0,0.98000000000000065,4.5149999999999988,3.2050000000000005,0.59000000000000152,0,5.5899999999999963,0,0.89999999999999836,1.2249999999999976,3.4049999999999967,5.1799999999999979,9.66,12.049999999999997,16.619999999999997,21.89,17.204999999999998,15.98,15.149999999999999,13.044999999999996,9.8699999999999974,12.36,4.5600000000000005,7.6749999999999927,7.18,4.7249999999999925,6.6299999999999955,5.5450000000000017,5.7400000000000055,7.3699999999999974,6.5200000000000005]
[null,900,451,0,2.620000000000001,3.6449999999999991,2.6850000000000005,0.40500000000000103,0,5.5349999999999984,0,1.2650000000000006,2.4149999999999991,5.3949999999999996,8.14,13.245000000000001,16.939999999999998,23.005000000000003,29.940000000000005,26.144999999999996,21.240000000000002,19.645,17.419999999999998,13.715,16.074999999999999,7.1800000000000033,9.9199999999999946,9.0350000000000001,7.3249999999999984,8.3149999999999977,6.9750000000000014,5.8950000000000031,7.4699999999999989,7.6850000000000005]
[null,1200,452,0,4.0470000000000006,2.6362499999999986,1.7527500000000007,0.68875000000000131,0,5.2059999999999995,0,1.5485000000000024,3.4247499999999995,7.0157500000000006,10.545000000000002,15.988499999999998,20.738499999999998,27.920499999999997,36.090499999999992,33.330749999999995,25.175000000000001,22.932999999999996,20.705249999999996,16.681999999999999,18.8005,9.3100000000000023,11.556749999999996,10.345499999999999,9.4287500000000026,9.4999999999999982,7.9847500000000009,5.7475000000000005,7.1914999999999996,8.4074999999999989]
[null,1500,453,0,5.7509999999999994,1.7144999999999995,0.61199999999999977,0.94050000000000156,0,4.8825000000000029,0,1.7955000000000043,4.3155000000000001,8.4375000000000036,12.654000000000003,18.373500000000003,24.048000000000002,32.197500000000005,41.435999999999993,39.622499999999995,28.584000000000003,25.771500000000003,23.552999999999997,19.264500000000002,21.154499999999999,11.178000000000004,12.968999999999998,11.470500000000001,11.272500000000008,10.516500000000001,8.8515000000000015,5.5844999999999985,6.9030000000000022,9.0135000000000005]
[null,2000,454,0,8.4490000000000016,1.0015833333333335,0,1.3415833333333351,0,4.5333333333333385,0,2.2128333333333403,5.7615833333333359,10.787916666666671,16.144333333333336,22.431500000000003,29.639499999999995,39.454166666666673,50.538166666666655,50.086249999999993,34.44766666666667,30.707666666666668,28.442416666666666,23.641333333333336,25.24216666666667,14.268666666666672,15.428916666666666,13.461166666666667,14.329583333333348,12.319333333333336,10.385583333333333,5.4938333333333285,6.66116666666667,10.163166666666667]
[500,600,500,0,1.9600000000000013,4.4099999999999984,1,0.17000000000000148,0,4.8199999999999967,0,0.53999999999999171,0.40999999999999615,2.9599999999999929,3.8800000000000008,8.5300000000000011,12.769999999999996,18.439999999999998,26.430000000000003,15.639999999999993,13.130000000000003,11.889999999999993,11.370000000000001,6.9999999999999911,9.9000000000000039,3.1799999999999979,4.9099999999999948,4.6399999999999997,3.2399999999999922,4.1599999999999895,4.4299999999999988,3.4000000000000057,5.4899999999999949,6.25]
[null,900,501,0,0.98000000000000043,3.9699999999999989,2,0.81000000000000205,0,5.509999999999998,0,0.90999999999999659,2.1599999999999966,5.0499999999999963,6.5300000000000011,11.469999999999999,16.519999999999996,22.700000000000003,31.450000000000003,24.109999999999996,16.86,13.949999999999996,13.850000000000001,9.3199999999999932,12.370000000000005,4.9900000000000011,6.469999999999998,7.1700000000000017,5.9699999999999971,5.4899999999999949,5.2100000000000009,3.7700000000000031,5.6899999999999977,6.7900000000000009]
[null,1200,502,0,0,3.353499999999999,2.242,1.3775000000000026,0,5.8899999999999988,0,1.2160000000000013,3.7144999999999966,6.7830000000000004,8.7210000000000001,13.689499999999995,19.256499999999996,25.612000000000002,34.646499999999996,30.950999999999997,19.560499999999994,15.209499999999997,15.513499999999997,11.057999999999991,14.098000000000003,6.4600000000000026,7.6285000000000007,9.2150000000000016,8.2650000000000006,6.4790000000000001,5.6905000000000019,3.9330000000000003,5.5955000000000004,6.9635000000000016]
[null,1500,503,0,0,2.7809999999999997,1.2239999999999995,1.8810000000000031,0,6.2010000000000005,0,1.4850000000000056,5.0939999999999959,8.3070000000000039,10.647,15.614999999999995,21.617999999999999,28.09800000000001,37.340999999999994,36.945,21.887999999999995,16.263000000000002,16.928999999999995,12.563999999999995,15.579000000000002,7.7490000000000059,8.6310000000000056,11.007000000000005,10.287000000000006,7.3350000000000053,6.0930000000000035,4.0589999999999984,5.4810000000000034,7.0830000000000028]
[null,2000,504,0,0,2.003166666666667,0,2.6831666666666703,0,6.8340000000000023,0,1.9266666666666787,7.2901666666666642,10.806333333333342,13.809666666666665,18.912499999999994,25.729499999999994,32.57200000000001,42.378166666666658,46.891666666666673,25.956166666666658,18.277833333333337,19.501833333333327,15.152666666666661,18.212666666666667,9.8826666666666778,10.361500000000008,13.979666666666672,13.583000000000013,8.8116666666666781,6.8595000000000059,4.3576666666666615,5.4598333333333402,7.4545000000000039]
[560,600,560,0,0.98000000000000065,2.7049999999999992,1.0449999999999995,8.5000000000000742E-2,0,2.4099999999999984,1,0.26999999999999585,0.70000000000000218,1.4949999999999966,3.3250000000000006,6.7199999999999989,11.449999999999996,16.449999999999996,19.889999999999997,13.484999999999991,9.7700000000000031,10.594999999999995,10.530000000000003,5.4999999999999956,7.2900000000000054,2.089999999999999,4.4549999999999974,3.8999999999999981,2.6199999999999961,3.5799999999999947,2.7149999999999994,2.2000000000000028,3.7449999999999974,4.3149999999999995]
[null,900,561,0,0.49000000000000021,2.9849999999999994,2.3499999999999996,0.40500000000000103,0,2.754999999999999,1.5,0.45499999999999829,2.5899999999999994,4.0749999999999993,6.44,9.3299999999999983,14.394999999999996,20.565000000000001,25.22,19.564999999999994,13.030000000000001,12.084999999999997,11.850000000000001,7.1599999999999966,8.9400000000000048,2.9950000000000006,5.2349999999999994,5.4250000000000007,4.4849999999999985,4.2449999999999974,3.6050000000000004,2.8850000000000016,4.3449999999999989,4.96]
[null,1200,562,0.19950000000000079,0.30399999999999944,4.3889999999999993,3.16825,0.68875000000000131,0,2.9449999999999994,2.4320000000000004,0.60800000000000065,4.2559999999999967,6.3222500000000004,9.0772499999999994,11.342999999999996,16.472999999999995,23.445999999999998,29.022499999999994,24.362749999999998,15.475499999999997,12.896249999999998,12.511499999999998,8.5737499999999933,10.060500000000003,3.9852499999999997,5.8142500000000004,6.6025000000000018,6.1037499999999998,5.3675000000000015,4.6407500000000024,3.5435000000000008,4.2977500000000006,5.3247499999999999]
[null,1500,563,0.37800000000000156,0.57599999999999874,3.0419999999999989,3.2760000000000007,0.94050000000000156,0,3.1005000000000003,2.0294999999999992,0.74250000000000282,5.7329999999999934,8.3115000000000041,11.402999999999999,13.094999999999999,18.256499999999999,25.915500000000009,32.291999999999994,28.552500000000002,17.594999999999999,13.558500000000002,13.040999999999995,8.8109999999999928,11.016000000000002,4.4010000000000007,6.6915000000000031,7.6275000000000048,6.8850000000000016,5.4675000000000056,4.0140000000000011,3.1049999999999995,4.7115000000000009,5.6250000000000009]
[null,2000,564,0.65450000000000264,0.99733333333333118,2.5015833333333335,3.6564166666666673,1.3415833333333351,0,3.4170000000000011,2,0.96333333333333937,8.0919999999999916,11.504750000000005,15.182416666666665,16.064999999999998,21.414333333333332,30.305333333333344,38.048833333333334,35.579583333333346,21.235833333333328,14.916083333333336,14.186499999999992,10.576333333333331,12.7415,5.7113333333333394,7.3680833333333391,9.3641666666666747,8.7915000000000063,6.405833333333339,4.429750000000003,3.1788333333333307,4.6126666666666702,6.2262500000000021]
[630,600,630,0,0,1,1.089999999999999,0,0,1,2,0,0.99000000000000821,3.0000000000000249E-2,2.7700000000000005,4.9099999999999957,10.129999999999995,14.459999999999994,13.349999999999993,11.329999999999988,6.4100000000000028,9.2999999999999972,9.6900000000000048,4,4.6800000000000068,1,4,3.1599999999999966,2,3,1,1,2,2.3799999999999981]
[null,900,631,0,0,2,2.6999999999999997,0,0,1,3,0,3.0200000000000022,3.1000000000000014,6.35,7.1899999999999968,12.269999999999996,18.43,18.989999999999995,15.019999999999994,9.2000000000000028,10.219999999999999,9.8500000000000014,5,5.5100000000000051,1,4,3.6799999999999997,3,3,2,2,3,3.129999999999999]
[null,1200,632,0.39900000000000158,0.60799999999999887,5.4244999999999992,4.0945,0,0,1,4.8640000000000008,0,4.7974999999999968,5.8615000000000013,9.4334999999999969,8.9964999999999993,13.689499999999995,21.279999999999998,23.398499999999995,17.7745,11.390500000000001,10.583,9.5094999999999974,6.0894999999999966,6.0230000000000032,1.5104999999999964,4,3.9900000000000024,3.9424999999999986,4.2560000000000038,3.591000000000002,3.1540000000000008,3,3.6859999999999991]
[null,1500,633,0.75600000000000311,1.1519999999999975,3.3029999999999986,5.3280000000000021,0,0,2,4.0589999999999984,0,6.3719999999999919,8.3160000000000043,12.158999999999999,10.575000000000001,14.894999999999998,23.733000000000004,27.242999999999999,20.160000000000007,13.302000000000003,10.854000000000003,9.1529999999999951,5.0579999999999909,6.4530000000000021,1.0529999999999953,4.7520000000000016,4.2480000000000055,3.4829999999999979,3.6000000000000063,1.9349999999999987,2.1510000000000007,3.9419999999999993,4.1669999999999989]
[null,2000,634,1.3090000000000053,1.9946666666666624,3,7.3128333333333346,0,0,2,4,0,8.8938333333333173,12.20316666666667,16.555166666666665,13.217500000000001,17.099166666666665,28.038666666666675,33.719500000000004,24.267500000000013,16.515499999999999,11.554333333333338,8.8711666666666567,6,7.2703333333333324,1.54,4.3746666666666698,4.7486666666666766,4,4,2,2,3.7655000000000003,4.9980000000000002]
[710,600,710,0,0,0.14750000000000041,1.1124999999999987,0,0,0,2.5,0,1.1350000000000113,0,2.4925000000000006,4.0049999999999937,9.4699999999999953,13.464999999999993,10.079999999999991,10.252499999999987,4.7300000000000022,8.6524999999999981,9.2700000000000067,3.2500000000000022,3.3750000000000075,0.45500000000000052,3.7725000000000013,2.7899999999999956,1.6900000000000019,2.7100000000000026,0.14250000000000029,0.39999999999999858,1.1275000000000013,1.4124999999999974]
[null,900,711,0,0,1.5075000000000003,2.875,0,0,1,3.75,0,3.2350000000000039,2.6125000000000025,6.3049999999999997,6.1199999999999957,11.207499999999996,17.362499999999997,15.874999999999993,12.747499999999995,7.2850000000000037,9.2874999999999996,8.8500000000000014,3.9200000000000017,3.7950000000000053,2.4999999999997247E-3,3.3825000000000003,2.8074999999999992,2.2575000000000007,2.3775000000000013,1.1974999999999998,1.5574999999999992,2.3275000000000006,2.2149999999999985]
[null,1200,712,0.49875000000000197,0.75999999999999857,5.9422499999999996,4.5576249999999998,0,0,1,6.080000000000001,0,5.0682499999999973,5.6311250000000017,9.6116249999999965,7.8232500000000007,12.297749999999995,20.196999999999996,20.586499999999994,14.480375,9.3480000000000025,9.4263750000000002,8.008499999999998,4.8473749999999978,4.0042500000000034,0.27312499999999473,3.0928749999999998,2.6837500000000025,2.8618749999999977,3.7002500000000049,3.0661250000000018,2.9592500000000008,2.3511249999999997,2.8666249999999986]
[null,1500,713,0.94500000000000384,1.4399999999999968,3.4334999999999987,6.3540000000000028,0,0,1,5.0737499999999978,0,6.6914999999999907,8.3182500000000044,12.536999999999999,9.3150000000000013,13.214249999999996,22.641750000000002,24.718499999999999,15.96375000000001,11.155500000000005,9.501750000000003,7.2089999999999952,3.18149999999999,4.1715000000000018,0,3.7822500000000008,2.5582500000000059,1.781999999999996,2.6662500000000069,0.89549999999999752,1.6740000000000013,3.5572499999999985,3.4379999999999979]
[null,2000,714,1.6362500000000066,2.4933333333333279,3.2492083333333333,9.1410416666666681,0,0,2,5,0,9.2947499999999792,12.552375000000001,17.241541666666663,11.793750000000003,14.941583333333332,26.905333333333338,31.554833333333338,18.611458333333346,14.155333333333335,9.873458333333339,6.2134999999999891,3.7118333333333347,4.5347499999999989,0,2.8779583333333352,2.4409166666666775,1.6042499999999968,2.7970833333333305,0.78512499999999852,1.4105833333333346,3.3419166666666653,4.3838749999999997]
[800,600,800,0,0,0,1.1237499999999985,0,0,0,2.75,0,1.2075000000000129,0,2.3537500000000007,3.5524999999999927,9.1399999999999952,12.967499999999992,8.4449999999999896,9.7137499999999868,3.8900000000000019,8.3287499999999994,9.0600000000000076,2.8750000000000036,2.7225000000000081,0.18250000000000077,3.6587500000000022,2.6049999999999951,1.5350000000000028,2.5650000000000039,0,9.9999999999997868E-2,0.69125000000000192,0.92874999999999708]
[null,900,801,0,0,1.2612500000000004,2.9625000000000004,0,0,0,4.125,0,3.3425000000000047,2.368750000000003,6.2824999999999998,5.5849999999999955,10.676249999999996,16.828749999999996,14.317499999999992,11.611249999999995,6.3275000000000041,8.8212499999999991,8.3500000000000014,3.3800000000000026,2.9375000000000053,0,3.0737500000000004,2.371249999999999,1.8862500000000011,2.0662500000000019,0.79624999999999968,1.3362499999999988,1.9912500000000009,1.7574999999999983]
[null,1200,802,0.54862500000000214,0.83599999999999841,6.2011249999999993,4.7891874999999997,0,0,1,6.6880000000000006,0,5.2036249999999971,5.5159375000000015,9.7006874999999972,7.2366250000000019,11.601874999999996,19.655499999999996,19.180499999999995,12.833312500000002,8.3267500000000041,8.8480625000000011,7.2579999999999982,4.2263124999999988,2.9948750000000035,0,2.6393125,2.0306250000000023,2.3215624999999971,3.4223750000000055,2.8036875000000014,2.8618750000000008,2.0266874999999995,2.4569374999999987]
[null,1500,803,1.0395000000000043,1.5839999999999965,3.4987499999999985,6.8670000000000027,0,0,1,5.5811249999999974,0,6.8512499999999896,8.3193750000000044,12.725999999999999,8.6850000000000023,12.373874999999995,22.096125000000001,23.456249999999997,13.865625000000012,10.082250000000005,8.8256250000000023,6.2369999999999948,2.2432499999999895,3.0307500000000016,0,3.2973750000000006,1.7133750000000061,0.93149999999999511,2.199375000000007,0.37574999999999692,1.4355000000000016,3.3648749999999978,3.0734999999999975]
[null,2000,804,1.7998750000000072,2.7426666666666604,3.3738124999999997,10.055145833333334,0,0,1,5.5,0,9.4952083333333093,12.726979166666666,17.584729166666662,11.081875000000004,13.862791666666666,26.338666666666668,30.472500000000004,15.783437500000012,12.975250000000003,9.0330208333333388,4.8846666666666554,2.567750000000002,3.1669583333333322,0,2.1296041666666676,1.287041666666678,0.40637499999999527,2.1956249999999957,0.17768749999999778,1.1158750000000019,3.1301249999999978,4.0768124999999991]